program: Gaussian 16
title: OH_H-H+
version: ES64L-G16RevC.01
method: RwB97XD
basis: GenECP
operation: Freq
keyword: #N
keyword: Geom=AllCheck
keyword: Guess=TCheck
keyword: SCRF=Check
keyword: GenChk
keyword: RwB97XD/GenECPFreq
converged: YES YES NO YES
title: Mulliken charges:
elementType: C H C N N B H C H H H H H C O H
charge: 0.042207 0.325491 -0.075504 -0.048176 -0.225966 -0.099718 0.447566 -0.390391 0.253074 0.233199 0.201874 0.038798 -0.020758 0.165881 -0.202398 0.354821
chargesum: 1.00000
title: Mulliken charges with hydrogens summed into heavy atoms:
elementType: C C N N B C C O
charge: 0.367698 -0.075504 -0.048176 0.221600 -0.081678 0.297756 0.165881 0.152423
1716.lowfreq: -32.7989 -0.0003 0.0002 0.0007 32.8071 45.2705 144.0290 173.9700 233.9944
frequency: 142.4715 172.3438 233.6436 237.3446 285.7662 305.0173 312.5147 425.4758 542.9678 597.6964 630.0222 647.2207 675.2906 747.3213 860.6871 888.1693 893.1642 1003.3977 1029.7540 1097.5095 1163.2458 1166.7974 1206.4139 1245.0121 1309.0574 1321.3835 1393.2265 1454.7961 1491.2580 1501.2914 1519.5617 1570.6272 1666.7338 1738.7469 2616.0485 2712.3150 3092.8497 3182.8901 3206.4119 3293.7720 3664.6999 3878.4799
redmass: 2.3102 1.4397 2.2408 2.2439 1.9840 1.4752 2.8554 1.3465 3.2393 4.2067 1.3393 2.9316 6.1084 8.2116 1.5301 1.5914 2.7455 1.4101 4.6313 1.5533 1.4997 1.3187 1.2299 1.6289 2.3899 2.9722 4.6493 1.6173 1.2446 1.0370 1.0984 5.5316 6.2546 3.8044 1.0538 1.1320 1.0326 1.1080 1.1065 1.1025 1.0829 1.0665
irintensity: 2.5176 0.2284 6.2507 2.5271 38.2488 60.5629 2.5685 0.9591 1.7381 17.2796 132.7241 47.2646 50.6681 14.1611 18.8877 27.0328 12.9240 40.8999 2.6818 36.4627 196.0779 11.4003 84.5200 68.6142 69.4748 31.3692 4.8462 40.7454 8.6146 21.2191 39.9026 29.1805 382.8836 315.1208 128.3423 93.3280 6.3068 0.9397 0.1777 16.0880 199.4482 298.1031
temp: 298.150 k
press: 1.00000 atm
elementType: 6 1 6 7 7 5 1 6 1 1 1 1 1 6 8 1
symmnumber: 1
zpe: 341673.8 jmol-1
zpe.correction: 0.130137 hartree
zpe.thermalcorrener: 0.138036 hartree
zpe.thermalcorrenthalpy: 0.138980 hartree
zpe.thermalcorrgfe: 0.098419 hartree
zpe.sumelectzpe: -366.476802 hartree
zpe.sumelectthermal: -366.468902 hartree
zpe.sumelectthermalent: -366.467958 hartree
zpe.sumelectthermalfe: -366.508520 hartree
dipole: 11.0289 5.8709 -3.3394
dipole: 12.9327
quadrupole: -18.0711 -25.2257 -30.4617
quadrupole: 8.3056 -7.6762 3.7007
quadrupole: 6.5151 -0.6396 -5.8755 8.3056 -7.6762 3.7007
hfenergy: -366.6069384 hartree
pointgroup: C01 [X(C4H8B1N2O1)]
dipole: -0.2691189 -0.0975839 -1.0162637 debye
dipolederiv: 0.27477 -0.3932653 0.2492742 -0.3554668 0.4637303 -0.254717 0.3047409 -0.3552474 0.2981411 0.16174 0.0313049 -0.0051618 0.0221714 0.1348636 -0.0147741 -0.0202085 0.0123261 0.1403803 -0.5155343 0.5381894 -0.2418658 0.5400892 -0.8167125 0.4954382 -0.2304501 0.4746673 -0.0271786 -0.3610958 0.3462386 -0.0676257 0.142733 -0.5451124 -0.2222082 -0.3864656 0.3429328 -0.7527998 -0.3235148 0.1241264 -0.1108693 0.2326387 -0.5920397 0.0883866 0.0822134 -0.2564736 -0.4209722 0.7508761 -0.4272816 0.2634902 -0.3977361 0.9763758 -0.280131 0.3110713 -0.3676517 0.7479378 0.3333819 0.0029649 -0.0415224 -0.0090216 0.386111 0.0269493 -0.0664654 0.0694839 0.2642664 0.3187428 -0.2240169 0.0043711 -0.2187778 0.5832021 -0.0543102 -0.0139124 -0.0111104 0.1332541 0.0195572 -0.0003709 0.0622861 0.0447502 0.005637 0.0204416 0.0422652 0.0634989 0.0660311 0.0043614 0.0288355 -0.0299497 -0.0353054 -0.0036282 -0.0206786 -0.0528185 0.0022 0.1045227 0.1095981 0.0177908 -0.0398049 0.0323923 0.0718502 0.0186181 -0.0031621 -0.046794 -0.012447 -0.1291716 0.0062813 -0.0096669 -0.0234249 -0.1156431 -0.0556239 -0.0557204 0.0312982 -0.2390311 -0.1508921 0.0348091 0.0033196 0.061669 -0.2448731 -0.0021751 0.0446205 -0.0761907 -0.1263099 0.6614464 -0.1808206 0.4359756 -0.1137309 0.6997697 0.1140775 0.5475766 -0.0823577 1.9671765 -0.5211756 0.0245206 -0.4719131 -0.0132417 -0.3049295 0.0415948 -0.5374709 0.1619132 -1.7239405 0.3669102 0.0706939 -0.0003373 0.0902615 0.3013988 0.0991119 0.0341859 0.0375052 0.5809691 unknown
polarizability: 67.2862344|-24.9012364|89.34554|16.7144907|-5.976518|88.8309166 unknown
InChI: InChI=1/C4H8BN2O/c1-7-2-3(5)6-4(7)8/h2,6,8H,5H2,1H3
charge 1 multiplicity 1
16 atoms
C  2.65764269 1.59558538 1.05977767
H  2.66058406 2.13816944 1.99107137
C  3.22618208 0.39398885 0.75450594
N  2.0157601 2.08613153 -0.05231658
N  2.89832024 0.18173905 -0.59839477
B  4.0469717 -0.54641777 1.63861252
H  3.1666505 -0.62770146 -1.14024027
C  1.28017838 3.34598374 -0.176368
H  1.80832477 4.01583483 -0.85347913
H  0.27819675 3.14696426 -0.55255879
H  1.21675199 3.79401181 0.81188285
H  4.23808898 -0.22092282 2.76518606
H  4.47283395 -1.56443893 1.19242671
C  2.18383262 1.20305058 -1.04623099
O  1.67956632 1.42225567 -2.22843049
H  1.8765429 0.72696205 -2.86552237
