program: Gaussian 16
title: NO2_H-H+
version: ES64L-G16RevC.01
method: RwB97XD
basis: GenECP
operation: Freq
keyword: #N
keyword: Geom=AllCheck
keyword: Guess=TCheck
keyword: SCRF=Check
keyword: GenChk
keyword: RwB97XD/GenECPFreq
converged: YES YES YES YES
title: Mulliken charges:
elementType: C H C N N B H C H H H H H C N O O
charge: 0.224980 0.380551 -0.113424 0.014588 -0.119691 -0.105521 0.449130 -0.431875 0.273854 0.263607 0.192003 0.062121 -0.000999 0.049729 -0.224860 0.057798 0.028008
chargesum: 1.00000
title: Mulliken charges with hydrogens summed into heavy atoms:
elementType: C C N N B C C N O O
charge: 0.605531 -0.113424 0.014588 0.329440 -0.044399 0.297588 0.049729 -0.224860 0.057798 0.028008
1716.lowfreq: 0.0007 0.0008 0.0011 6.1896 20.8412 36.1745 103.3417 138.6125 185.2143
frequency: 102.8769 136.3931 185.0167 199.9281 268.1012 278.8909 315.4991 369.4391 378.7059 423.1896 555.3400 606.0648 649.9230 668.0991 742.8491 755.4618 786.5977 851.8701 879.4696 913.3759 1018.2016 1044.4671 1104.3314 1170.2707 1172.7075 1195.6060 1237.5222 1271.7543 1375.7658 1400.0920 1435.8273 1472.6309 1492.7874 1502.4805 1519.1705 1607.9484 1652.9536 1706.1987 2634.9898 2739.4534 3102.7508 3205.6231 3211.6840 3291.4731 3612.8962
redmass: 9.6745 3.8684 3.7106 2.9708 2.1584 1.7039 2.6416 2.9776 1.1924 8.2128 4.6050 4.6645 6.8028 3.7590 4.4908 5.0374 1.3529 1.4733 8.2510 1.3418 1.4154 4.6071 1.7287 1.3427 1.4423 3.0876 1.3815 1.5303 4.2058 4.5714 5.6687 1.7968 1.5634 1.2159 1.2574 6.7290 4.8781 13.0181 1.0520 1.1338 1.0310 1.1089 1.1093 1.1036 1.0834
irintensity: 0.4152 0.7342 7.5558 7.0907 2.1995 0.8804 0.1484 2.2132 0.6871 6.9045 1.4320 8.5474 8.3113 6.3552 16.7701 17.2125 88.7331 13.7688 90.2301 38.2473 41.4743 0.9987 6.9158 0.0321 129.0457 6.4410 261.0226 20.5326 76.4436 80.8382 140.1450 25.3792 31.6746 18.9533 16.3132 42.4228 122.1080 353.3348 104.0571 70.7053 0.4786 0.2388 0.7301 21.5107 253.3829
temp: 298.150 k
press: 1.00000 atm
elementType: 6 1 6 7 7 5 1 6 1 1 1 1 1 6 7 8 8
symmnumber: 1
zpe: 336429.8 jmol-1
zpe.correction: 0.128139 hartree
zpe.thermalcorrener: 0.137053 hartree
zpe.thermalcorrenthalpy: 0.137997 hartree
zpe.thermalcorrgfe: 0.094422 hartree
zpe.sumelectzpe: -495.710905 hartree
zpe.sumelectthermal: -495.701992 hartree
zpe.sumelectthermalent: -495.701048 hartree
zpe.sumelectthermalfe: -495.744623 hartree
dipole: 12.2109 7.0262 2.0629
dipole: 14.2383
quadrupole: -19.8078 -31.7774 -56.4721
quadrupole: 11.3124 3.2452 5.0595
quadrupole: 16.2113 4.2417 -20.4530 11.3124 3.2452 5.0595
hfenergy: -495.8390448 hartree
pointgroup: C01 [X(C4H7B1N3O2)]
dipole: 0.4171142 0.2543896 2.1554751 debye
dipolederiv: 0.0652731 -0.1565556 -0.1362047 -0.0689311 0.2394058 0.2345351 0.0663008 -0.1066898 0.0034693 0.1623991 0.0306063 0.0004165 0.0243275 0.1379352 0.0027128 -0.0100357 0.0149901 0.1700155 -0.3261694 0.3447923 -0.2070147 0.2674869 -0.4746439 0.1396572 -0.3763071 0.4275346 -0.5610783 -0.2109721 0.2159167 0.0071228 0.2143577 -0.4403393 0.0414006 -0.0042224 0.0409735 -0.0035487 -0.1393587 0.1187021 0.2445972 0.1232341 -0.4909318 -0.3018953 0.2615773 -0.3237824 0.1403523 0.7598607 -0.3582246 0.3231425 -0.3681555 0.9278463 -0.3901232 0.2929109 -0.3374201 0.8411795 0.3499956 -0.0447175 -0.0315239 -0.0432052 0.4366108 0.0532684 -0.0327249 0.0572709 0.3338434 0.2670007 -0.1941306 0.0047796 -0.2020138 0.4973147 -0.0104173 -0.0293715 0.0551645 0.174946 0.0341116 0.0208738 0.0611221 0.0356033 0.0592895 -0.0051879 0.0457435 0.0371244 0.0712254 0.0520713 0.0011886 -0.0179911 -0.0315759 0.005883 -0.0344322 -0.0430775 -0.0093811 0.1072757 0.1122496 0.0114692 -0.052389 0.0309003 0.0875538 0.0269524 -0.007436 -0.0425157 -0.0064856 -0.1283203 0.0007354 -0.0073028 -0.0164129 -0.1140757 -0.0346973 -0.0423179 0.0304574 -0.2167376 -0.1509495 0.0271187 -0.0087272 0.0462865 -0.2045803 0.0163502 0.0369577 -0.0616466 -0.1269908 0.229955 -0.0071102 -0.3922713 0.0014274 0.4662328 0.3105555 -0.3727072 0.2748712 -0.4847958 0.7700207 -0.7091056 0.3618091 -0.679422 1.6397382 0.2378005 0.4215823 0.1351068 2.1634788 -0.4863238 0.4465059 -0.1536911 0.4064398 -0.9152232 0.0506956 -0.2288613 0.1851716 -0.6833609 -0.3608436 0.2519352 0.004126 0.2596531 -0.8580158 -0.3371751 0.021989 -0.3772294 -0.922788 unknown
polarizability: 73.3270057|-30.4502687|102.5554971|19.505504|-4.1489322|115.3559595 unknown
InChI: InChI=1/C4H7BN3O2/c1-7-2-3(5)6-4(7)8(9)10/h2,6H,5H2,1H3
charge 1 multiplicity 1
17 atoms
C  2.627033 1.6154917 1.06439295
H  2.58333213 2.12976389 2.01091559
C  3.23082763 0.42068628 0.74779627
N  2.03338144 2.13124125 -0.05196249
N  2.9724682 0.24745562 -0.59696786
B  4.02885787 -0.56077859 1.64019225
H  3.26711478 -0.53216186 -1.1765386
C  1.28240879 3.39928928 -0.09656825
H  1.78249083 4.09325627 -0.76757651
H  0.26952565 3.20892414 -0.44100573
H  1.26756446 3.79460754 0.91567929
H  4.17284879 -0.27633761 2.78249007
H  4.46391355 -1.5565948 1.16156489
C  2.26766095 1.26746675 -1.04570515
N  1.84441773 1.37227616 -2.43335506
O  1.22045147 2.35775512 -2.74250061
O  2.16951205 0.4455113 -3.13800523
