program: Gaussian 16
title: MeIM + H+
version: ES64L-G16RevC.01
method: RwB97XD
basis: GenECP
operation: Freq
keyword: #N
keyword: Geom=AllCheck
keyword: Guess=TCheck
keyword: SCRF=Check
keyword: GenChk
keyword: RwB97XD/GenECP
keyword: Freq
converged: YES YES NO YES
title: Mulliken charges:
elementType: C H C N N N B H C H H H H H
charge: -0.220056 0.337471 0.023174 0.208704 0.028641 -0.133024 -0.083147 0.474892 -0.411370 0.230320 0.253101 0.223691 0.045852 0.021752
chargesum: 1.00000
title: Mulliken charges with hydrogens summed into heavy atoms:
elementType: C C N N N B C
charge: 0.117415 0.023174 0.208704 0.028641 0.341868 -0.015543 0.295741
1716.lowfreq: -76.2461 -52.0149 -2.1972 -0.0007 -0.0006 0.0002 125.8132 167.0959 238.4197
frequency: 125.4899 163.0694 237.6477 254.5617 297.5085 411.0647 607.3108 662.5722 705.5117 749.1021 775.3051 848.0401 912.6914 987.1861 1075.6721 1086.9171 1106.1744 1155.0375 1187.8270 1240.6695 1298.3511 1377.3355 1397.5085 1448.8780 1472.6251 1493.6564 1511.3238 1527.8506 1644.7228 2627.6290 2734.3141 3097.9775 3197.4823 3215.9875 3300.6149 3619.5461
redmass: 1.9085 1.2501 2.0417 1.2569 3.6321 2.7434 4.4824 3.3774 8.8242 4.4046 1.1764 1.4080 1.3140 1.4575 4.6881 2.7718 1.9067 1.3429 1.3282 1.4596 2.2481 6.3887 4.6505 2.3528 1.4568 1.0841 1.1960 2.2929 3.2759 1.0534 1.1329 1.0319 1.1077 1.1084 1.1047 1.0856
irintensity: 0.3274 0.1671 0.4782 0.2389 6.8039 6.0312 4.5097 12.4188 0.1723 45.6008 100.0305 12.4428 40.9555 35.1547 0.1471 11.4062 18.4282 0.4729 19.2896 114.0737 91.2039 2.7716 18.4824 1.9974 11.1847 21.8624 21.5516 17.9170 20.5205 89.3947 70.9546 1.4206 0.1854 0.7737 26.2546 236.3565
temp: 298.150 k
press: 1.00000 atm
elementType: 6 1 6 7 7 7 5 1 6 1 1 1 1 1
symmnumber: 1
zpe: 296405.7 jmol-1
zpe.correction: 0.112895 hartree
zpe.thermalcorrener: 0.119658 hartree
zpe.thermalcorrenthalpy: 0.120602 hartree
zpe.thermalcorrgfe: 0.082433 hartree
zpe.sumelectzpe: -307.256038 hartree
zpe.sumelectthermal: -307.249275 hartree
zpe.sumelectthermalent: -307.248331 hartree
zpe.sumelectthermalfe: -307.286501 hartree
dipole: 12.0278 6.8815 1.5902
dipole: 13.9481
quadrupole: -5.1168 -14.0383 -33.4815
quadrupole: 9.5043 3.8284 4.9007
quadrupole: 12.4287 3.5073 -15.9360 9.5043 3.8284 4.9007
hfenergy: -307.3689334 hartree
pointgroup: C01 [X(C3H7B1N3)]
dipole: -0.0837457 0.2158652 0.168876 debye
dipolederiv: 0.0669373 -0.0707985 -0.0437194 -0.0453325 0.1595669 0.0957438 0.0427601 -0.0620036 0.0867761 0.179143 0.0233775 -0.0024259 0.0203887 0.1536496 0.0031548 -0.0102904 0.0160445 0.1814597 -0.2418885 0.328647 -0.1386473 0.2755576 -0.4774483 0.1514616 -0.2671618 0.4006942 -0.3027789 -0.056041 0.0645388 0.0426237 0.0965445 -0.2203511 -0.0440454 0.0441584 -0.0491918 0.0457074 -0.0848569 -0.0058513 -0.2421815 0.000113 0.086212 0.3004915 -0.2171923 0.2615229 -0.3797931 -0.0752813 0.1016578 0.2085797 0.1174101 -0.3745502 -0.2475444 0.2256113 -0.2907837 0.2742717 0.7161362 -0.3330231 0.1993084 -0.3226342 0.9729993 -0.2666011 0.2259063 -0.3143654 0.7464892 0.3252769 -0.0040383 -0.0455242 -0.0069708 0.387167 0.0998348 -0.0511612 0.0999171 0.3538875 0.2623884 -0.1575514 0.0193315 -0.2070698 0.4978766 -0.0545112 0.0193849 -0.0535104 0.1017974 0.1148583 0.0310695 0.0301117 0.0370254 0.0753106 -0.0473348 -0.0027135 0.0164689 0.0361905 0.0362205 0.0274912 0.0326099 -0.0151589 0.0118359 0.0498597 0.0496451 0.0326319 0.0978706 0.033004 -0.0240568 -0.0645769 0.0335354 0.0421152 -0.0019509 -0.0572559 -0.0333501 0.0911736 -0.1332162 -0.002282 0.0019721 -0.0189733 -0.113725 -0.0333056 -0.0344325 0.0368775 -0.2007776 -0.1426806 0.0208197 0.0025383 0.0355648 -0.2006585 -0.0052528 0.0327415 -0.0609519 -0.132274 unknown
polarizability: 56.5205135|-21.606837|80.6063644|9.3977354|-4.2862881|73.6570708 unknown
InChI: InChI=1/C3H7BN3/c1-7-2-3(4)5-6-7/h2,5H,4H2,1H3
charge 1 multiplicity 1
14 atoms
C  2.59512387 1.62667368 1.14910651
H  2.54715078 2.12896928 2.10142073
C  3.15474817 0.41938938 0.79360297
N  2.06299978 2.14962302 0.02227437
N  2.24081715 1.3683403 -1.0133851
N  2.88727412 0.34959283 -0.54496464
B  3.92011959 -0.65850961 1.60723077
H  3.14212358 -0.39433778 -1.18557368
C  1.32885132 3.40736854 -0.13439725
H  1.24115015 3.6073266 -1.19867488
H  0.34283016 3.2993301 0.31378075
H  1.88909886 4.20010431 0.35591685
H  4.08250881 -0.47759498 2.76707963
H  4.31428016 -1.6238418 1.03912712
