program: Gaussian 16
title: h_naphthalene_prot
version: AS64L-G16RevC.02
method: RwB97XD
basis: GenECP
operation: Freq
keyword: #N
keyword: Geom=AllCheck
keyword: Guess=TCheck
keyword: SCRF=Check
keyword: GenChk
keyword: RwB97XD/GenECPFreq
converged: YES YES YES YES
title: Mulliken charges:
elementType: C C C C C C H C C H H C C H H H B N C H H H C H H H H H H
charge: -0.339416 -0.039395 0.316113 -0.224246 -0.122572 -0.486251 0.214190 0.178547 -0.228475 0.217655 0.273399 -0.416530 -0.235512 0.244160 0.267398 0.275518 -0.313808 0.312041 -0.315877 0.217489 0.239502 0.251784 -0.298584 0.246459 0.232897 0.239396 0.001047 0.053890 0.239181
chargesum: 1.00000
title: Mulliken charges with hydrogens summed into heavy atoms:
elementType: C C C C C C C C C C B N C C
charge: -0.125226 -0.039395 0.316113 -0.224246 0.095083 -0.212852 0.178547 0.015685 -0.149132 0.040006 -0.258870 0.551222 0.392899 0.420168
1716.lowfreq: -7.4291 -0.0004 -0.0002 0.0002 22.9612 29.7703 85.2784 117.0266 124.0693
frequency: 79.0323 116.3724 121.6614 178.1164 185.4313 203.0281 251.2843 281.5180 308.0752 317.0524 354.3645 394.8311 434.6355 479.0531 483.5654 500.6916 507.2247 539.5538 571.4279 607.3490 662.9857 677.2643 781.8633 793.4286 804.6145 817.4867 855.5702 901.0768 931.3766 946.0047 976.7098 1000.8717 1016.1833 1019.4052 1032.5003 1041.2677 1056.1296 1082.3872 1126.7487 1136.7598 1184.9046 1192.7176 1195.2574 1205.1906 1237.9068 1257.4123 1267.2116 1294.3366 1358.4079 1372.8885 1391.8936 1411.7957 1451.1292 1460.1960 1463.0635 1483.3451 1496.2144 1501.7875 1504.5802 1509.2506 1513.2033 1531.8323 1572.4094 1635.3145 1661.2600 1707.1182 2532.2599 2660.5574 3090.9321 3098.3189 3193.3888 3197.0441 3201.9753 3202.7486 3202.7647 3208.6716 3211.5812 3217.6278 3228.2725 3232.8150 3344.1633
redmass: 3.4721 2.9321 2.7585 2.6706 2.4346 3.1802 1.3156 1.2414 1.8976 1.3890 3.4788 3.9589 2.7787 3.7529 3.7879 2.8140 4.5340 4.6288 5.7627 3.7035 3.1106 3.4243 1.7882 4.8151 1.5077 4.8504 2.0571 2.3466 1.6871 1.4111 1.3833 1.4401 2.9186 1.3950 2.2287 1.3549 4.5278 1.1612 1.8007 2.3423 1.3158 1.4964 1.9193 1.2138 2.1172 1.7443 1.7183 1.9692 1.4972 2.7129 2.9302 3.1199 1.1279 1.3469 1.4333 1.1251 1.2336 1.0609 1.7302 1.3065 1.1768 1.2176 3.3288 6.4135 5.2636 5.8476 1.0750 1.1057 1.0317 1.0310 1.1084 1.1072 1.0896 1.0972 1.1078 1.0913 1.0919 1.0991 1.0984 1.0983 1.0780
irintensity: 1.7833 1.4199 0.2656 4.4568 1.6913 5.1624 1.6917 1.4877 0.1131 1.6061 6.3965 4.5309 0.0531 2.4770 1.3710 6.8097 2.0462 13.2356 10.3505 0.3468 0.7026 1.7153 45.7874 4.2860 16.5537 2.2165 53.5296 38.1068 7.1688 3.4461 15.0435 14.6726 12.4448 1.4461 23.1488 0.0208 16.0929 3.4944 20.2434 40.1866 11.3405 17.4310 7.8248 16.1059 23.3429 10.6628 24.6844 0.2282 108.4746 11.0274 7.4545 12.0774 2.5197 12.6440 2.0933 13.3135 11.8741 13.8170 25.4932 39.2284 3.4181 36.6062 139.3350 53.8882 19.6034 2.1216 264.2798 158.0274 6.4210 1.5307 4.5209 0.4568 0.2439 1.8838 5.0661 1.4592 2.4890 2.7936 5.7304 2.1868 483.5327
temp: 298.150 k
press: 1.00000 atm
elementType: 6 6 6 6 6 6 1 6 6 1 1 6 6 1 1 1 5 7 6 1 1 1 6 1 1 1 1 1 1
symmnumber: 1
zpe: 653511.9 jmol-1
zpe.correction: 0.248910 hartree
zpe.thermalcorrener: 0.261086 hartree
zpe.thermalcorrenthalpy: 0.262030 hartree
zpe.thermalcorrgfe: 0.211537 hartree
zpe.sumelectzpe: -545.406765 hartree
zpe.sumelectthermal: -545.394589 hartree
zpe.sumelectthermalent: -545.393644 hartree
zpe.sumelectthermalfe: -545.444137 hartree
dipole: 5.3067 -0.0413 0.6304
dipole: 5.3441
quadrupole: -40.3507 -65.6705 -80.2328
quadrupole: -2.4002 3.3813 0.7306
quadrupole: 21.7339 -3.5858 -18.1481 -2.4002 3.3813 0.7306
hfenergy: -545.6556743 hartree
pointgroup: C01 [X(C12H15B1N1)]
dipole: 2.1589641 -0.0709249 0.1345717 debye
polarizability: 221.1771272|4.326206|224.9554359|11.9581156|6.8226729|103.1336385 unknown
InChI: InChI=1/C12H15BN/c1-14(2)11-8-4-6-9-5-3-7-10(13)12(9)11/h3-8,14H,13H2,1-2H3
charge 1 multiplicity 1
29 atoms
C  1.1112282 1.79539517 0.27142716
C  0.83962443 0.45673113 0.16133005
C  -0.47557285 -0.06636213 0.02603522
C  -1.50810336 0.91983479 -0.00763414
C  -1.21317744 2.2977313 0.10841973
C  0.07353334 2.73632426 0.24949693
H  2.13399931 2.14054497 0.37180563
C  -0.84698789 -1.46829105 -0.0904692
C  -2.86434795 0.52724124 -0.16500822
H  -2.03315683 3.00621215 0.07867053
H  0.29907564 3.79098633 0.33790423
C  -3.21025991 -0.78397906 -0.29622482
C  -2.19971921 -1.75871884 -0.25809324
H  -3.62277911 1.302225 -0.18280528
H  -4.24446592 -1.07805734 -0.42257223
H  -2.49011064 -2.79795924 -0.3552474
B  -0.00202849 -2.75380943 0.0024812
N  1.99590265 -0.45773112 0.17784435
C  2.9180768 -0.25772906 -0.98054034
H  3.4141311 0.70480793 -0.88176261
H  3.65408708 -1.06026998 -0.97655369
H  2.32945704 -0.28385795 -1.89558345
C  2.71004862 -0.46737454 1.49061836
H  3.44692745 -1.26944074 1.47463685
H  3.19919938 0.49238269 1.64080131
H  1.97514236 -0.64353769 2.27412216
H  -0.54311659 -3.80112762 -0.15354896
H  1.17373411 -2.84525426 0.24273183
H  1.61230468 -1.40486893 0.07761805
