program: Gaussian 16
title: H_H-H+
version: ES64L-G16RevC.01
method: RwB97XD
basis: GenECP
operation: Freq
keyword: #N
keyword: Geom=AllCheck
keyword: Guess=TCheck
keyword: SCRF=Check
keyword: GenChk
keyword: RwB97XD/GenECP
keyword: Freq
converged: YES YES NO YES
title: Mulliken charges:
elementType: C H C N N B H C H H H H H C H
charge: -0.106374 0.303449 -0.006241 0.014837 -0.187103 -0.079971 0.451040 -0.397406 0.187094 0.253477 0.223245 0.036596 -0.010054 0.014700 0.302712
chargesum: 1.00000
title: Mulliken charges with hydrogens summed into heavy atoms:
elementType: C C N N B C C
charge: 0.197075 -0.006241 0.014837 0.263936 -0.053428 0.266409 0.317412
1716.lowfreq: -53.7593 -30.2376 0.0001 0.0005 0.0006 54.7139 152.2065 160.0271 234.1779
frequency: 149.5072 158.4264 233.8890 277.8540 370.8010 386.2204 601.7250 646.7773 666.3000 723.7770 730.5105 848.9572 891.5171 915.7238 1010.4843 1023.9949 1067.5796 1107.8579 1151.8605 1182.9056 1194.3639 1246.5193 1290.6084 1393.2973 1417.5135 1457.2564 1491.8585 1496.5435 1522.0822 1591.7604 1662.2694 2621.5583 2719.7244 3089.9235 3184.5944 3199.6880 3294.2377 3297.6673 3659.0625
redmass: 2.9232 1.0648 2.3906 3.7543 1.0567 2.5182 4.4100 2.6828 4.2249 1.9948 1.6727 1.4269 1.3502 1.3996 1.4196 3.5030 4.4987 1.4005 1.3310 1.3438 1.2346 1.4194 1.9965 5.3746 2.7763 1.2594 1.6777 1.3967 1.1706 4.0510 4.2188 1.0539 1.1320 1.0326 1.1078 1.1076 1.1019 1.1063 1.0840
irintensity: 3.2820 0.1751 0.8659 0.4965 1.6908 1.6691 3.0073 44.0722 0.4158 55.9845 61.7796 16.7322 26.5286 17.9087 44.7116 2.7210 7.6824 3.4672 1.7076 37.8875 22.3026 135.0087 66.1968 0.5382 7.4228 0.6946 40.3549 37.4978 37.2020 1.9634 89.1888 119.5256 90.0133 6.8620 0.5566 1.1301 34.6719 15.3025 211.9216
temp: 298.150 k
press: 1.00000 atm
elementType: 6 1 6 7 7 5 1 6 1 1 1 1 1 6 1
symmnumber: 1
zpe: 328836.7 jmol-1
zpe.correction: 0.125247 hartree
zpe.thermalcorrener: 0.132014 hartree
zpe.thermalcorrenthalpy: 0.132959 hartree
zpe.thermalcorrgfe: 0.094909 hartree
zpe.sumelectzpe: -291.253934 hartree
zpe.sumelectthermal: -291.247166 hartree
zpe.sumelectthermalent: -291.246222 hartree
zpe.sumelectthermalfe: -291.284272 hartree
dipole: 10.9257 7.5112 -1.8274
dipole: 13.3839
quadrupole: -12.4890 -15.7482 -29.8679
quadrupole: 10.5780 -3.6344 0.5488
quadrupole: 6.8794 3.6201 -10.4995 10.5780 -3.6344 0.5488
hfenergy: -291.3791808 hartree
pointgroup: C01 [X(C4H8B1N2)]
dipole: -0.5062169 0.4733157 -1.0951981 debye
dipolederiv: 0.1332258 -0.218726 0.0857043 -0.2025291 0.3403129 -0.0825277 0.1568057 -0.2132876 0.164429 0.1683649 0.0295871 -0.0025443 0.0234834 0.1315035 -0.0114768 -0.014594 0.010662 0.1415866 -0.3735207 0.42387 -0.1807564 0.3967288 -0.7069233 0.3206135 -0.2524843 0.4592227 -0.1640683 -0.2504957 0.2112221 -0.0087002 0.1996047 -0.5181858 -0.062387 -0.1242537 0.1586527 -0.3149487 -0.2222197 0.1085134 0.1123714 0.1391159 -0.5139487 -0.1767753 0.1648071 -0.2818056 -0.0843423 0.7000505 -0.3763114 0.2145202 -0.3583064 1.0054437 -0.2753889 0.2592874 -0.3560777 0.7552192 0.3336544 -0.000897 -0.0365925 -0.0083907 0.3823388 0.0601708 -0.0515011 0.0830973 0.3066075 0.3005062 -0.1966051 0.0019264 -0.2339902 0.5742757 -0.0330194 -0.0052162 -0.0230605 0.1262768 0.1004231 0.0420826 0.0149853 0.0391488 0.0577051 -0.0432083 -0.0185632 0.0313176 -0.0318979 0.0130755 0.0396976 0.0399979 -0.0142265 0.0026626 0.0429133 0.060789 0.0141816 0.088264 0.0243207 -0.0334973 -0.0625963 0.0322462 0.0207408 -0.0106047 -0.0479105 -0.0537162 0.0828995 -0.1296069 0.0011983 -0.0005236 -0.0174809 -0.1146225 -0.0445417 -0.0438787 0.0385654 -0.2311496 -0.1527092 0.0353126 0.0048282 0.052196 -0.236483 -0.0087827 0.0428199 -0.0802634 -0.1321871 0.177341 -0.09333 -0.1840274 -0.0822411 0.4426046 0.3184377 -0.1367602 0.2288905 0.0919003 0.17759 0.0278832 0.0014071 0.0346411 0.1325756 0.0065772 0.0106528 -0.0163789 0.201411 unknown
polarizability: 60.4283096|-23.2650026|85.9945309|10.6224253|-5.3867814|79.7099822 unknown
InChI: InChI=1/C4H8BN2/c1-7-2-4(5)6-3-7/h2-3,6H,5H2,1H3
charge 1 multiplicity 1
15 atoms
C  2.59582397 1.60271733 1.09264627
H  2.55170606 2.09243754 2.05190449
C  3.15908612 0.40208107 0.74947369
N  2.04378755 2.16202055 -0.02863042
N  2.91429395 0.28293615 -0.61569699
B  3.90218812 -0.62416678 1.62116258
H  3.20300874 -0.4960055 -1.19168068
C  1.3212287 3.43481036 -0.08757693
H  1.18518482 3.71385409 -1.12961534
H  0.35202962 3.32431081 0.39599786
H  1.90979355 4.19860937 0.41585923
H  4.03314408 -0.38562084 2.77700203
H  4.32244048 -1.62095967 1.12732433
C  2.25129513 1.33567517 -1.05731692
H  1.93014121 1.50755582 -2.07184314
