program: Gaussian 16
title: h_quinoline_prot
version: AS64L-G16RevC.02
method: RwB97XD
basis: GenECP
operation: Freq
keyword: #N
keyword: Geom=AllCheck
keyword: Guess=TCheck
keyword: SCRF=Check
keyword: GenChk
keyword: RwB97XD/GenECP
keyword: Freq
converged: YES YES YES YES
title: Mulliken charges:
elementType: C C C C C C H C H H C C H H H N B H H H
charge: -0.152033 0.179934 -0.902985 0.231089 -0.308869 -0.548564 0.310497 1.145347 0.257280 0.273180 -0.956234 0.177588 0.317400 0.295967 0.323254 0.173779 -0.185795 -0.018327 0.062432 0.325059
chargesum: 1.00000
title: Mulliken charges with hydrogens summed into heavy atoms:
elementType: C C C C C C C C C N B
charge: 0.158464 0.179934 -0.902985 0.231089 -0.051589 -0.275384 1.462747 -0.660267 0.500842 0.498838 -0.141690
1716.lowfreq: -37.1574 -11.1603 0.0004 0.0004 0.0007 31.3256 143.0145 175.9720 223.5839
frequency: 140.1338 175.8984 223.4187 296.2163 353.5324 394.1701 422.6205 485.1441 488.3145 527.6025 529.7254 577.6784 622.4338 712.1510 772.7968 788.0976 818.5588 851.2764 868.3666 893.1302 899.9372 983.5395 1006.0095 1031.5789 1035.5006 1047.3214 1065.6618 1091.9449 1101.4426 1180.0857 1194.6180 1249.2314 1259.1411 1267.2160 1296.8858 1348.3173 1396.7719 1418.8897 1451.7039 1494.5930 1517.4993 1619.1619 1652.9664 1663.5086 1709.8665 2579.9213 2683.4676 3204.1213 3211.6037 3215.7212 3228.7322 3246.1633 3260.2693 3564.1002
redmass: 3.2988 3.6940 3.3067 3.0543 1.2629 2.3494 3.1694 2.8364 6.1633 5.8536 3.2759 6.1626 2.8464 5.0187 1.2950 3.3438 4.0973 1.5084 1.8425 1.3997 2.6813 1.3405 1.4105 1.3189 1.4354 1.3908 3.4043 2.2072 2.3368 1.2855 1.2554 2.2665 1.4310 1.4437 1.5259 1.9262 2.7074 7.9638 1.9742 2.3557 2.4562 2.7469 4.8620 5.9300 5.2166 1.0616 1.1213 1.0915 1.0922 1.0931 1.0982 1.0945 1.0992 1.0803
irintensity: 0.7773 2.1815 3.8066 5.9135 1.0336 3.9213 0.8385 3.0408 8.6278 5.0983 15.7222 6.7992 2.4535 3.2256 0.0622 42.8058 3.5973 117.1463 13.2671 1.3685 7.0769 9.7151 15.4244 24.6324 19.5526 1.8517 20.3295 12.7163 3.4671 18.2317 19.1349 42.1065 7.6698 12.3233 136.8511 23.3811 5.8488 68.5949 4.6462 8.8193 6.7058 102.5869 7.9911 157.6983 164.7765 145.7527 120.3055 0.3946 0.1662 0.2724 1.1685 3.1554 5.6792 200.3347
temp: 298.150 k
press: 1.00000 atm
elementType: 6 6 6 6 6 6 1 6 1 1 6 6 1 1 1 7 5 1 1 1
symmnumber: 1
zpe: 425384.6 jmol-1
zpe.correction: 0.162020 hartree
zpe.thermalcorrener: 0.170190 hartree
zpe.thermalcorrenthalpy: 0.171134 hartree
zpe.thermalcorrgfe: 0.129347 hartree
zpe.sumelectzpe: -427.577166 hartree
zpe.sumelectthermal: -427.568996 hartree
zpe.sumelectthermalent: -427.568052 hartree
zpe.sumelectthermalfe: -427.609839 hartree
dipole: 3.5440 0.3690 0.3298
dipole: 3.5784
quadrupole: -34.8023 -41.7133 -65.1523
quadrupole: 5.4814 1.1703 1.5700
quadrupole: 12.4204 5.5093 -17.9297 5.4814 1.1703 1.5700
hfenergy: -427.739186 hartree
pointgroup: C01 [X(C9H9B1N1)]
dipole: 1.3785975 0.2628094 0.0487246 debye
dipolederiv: 0.1367795 0.1193818 0.0103089 -0.4163778 0.5013565 0.0227017 -0.0222059 0.0352352 -0.0446164 -0.4240825 0.0341839 -0.0029355 0.3785186 -1.2387825 -0.0537317 0.0182179 -0.0617304 -0.1675791 0.5874059 -0.0827592 0.004192 -0.3802375 0.0365937 -0.0197416 -0.0153225 -0.0097864 0.1812898 -0.5895877 -0.0836537 -0.0184312 0.5361009 -0.2055296 -0.0030949 0.0187781 -0.0170256 0.0334349 0.2965876 -0.0486179 0.00424 0.1078811 0.1985617 0.0197728 0.0145942 0.0210673 -0.0834026 -0.3557901 0.3270785 0.0137809 0.449173 -0.1045622 0.0091542 0.0232309 0.0067601 -0.0952711 0.0033521 0.0228377 -0.0008633 0.0413236 0.1014385 -0.0014868 -0.0022247 -0.0020306 0.1318676 0.7546717 0.2965857 0.0348454 0.0669055 0.4416971 0.0278231 0.0218693 0.0306886 0.0136611 0.0711536 0.0610361 0.00184 0.0063648 0.0336135 -0.0063686 -0.0006618 -0.0078796 0.1498655 0.045845 -0.0543993 -0.0057102 -0.0473818 0.0304467 -0.0087147 -0.0055777 -0.0088745 0.1601736 -0.0679598 -0.1760782 -0.0080066 -0.5465714 -0.7743369 -0.0504516 -0.0350325 -0.0439742 -0.1515139 0.0566599 -0.5244439 -0.0332534 0.1515726 0.7252808 0.0410376 0.0143729 0.0269127 0.1118851 0.1163784 -0.0069879 -0.000667 0.0324413 0.0288855 -0.0051326 0.0010673 -0.0060491 0.1408656 0.0600735 0.002418 -0.0023693 -0.0039812 0.1157688 -0.0039974 -0.002901 -0.0036075 0.1750121 0.1323526 0.0140573 -0.0006654 0.0031202 0.091308 -0.0039587 -0.0019143 -0.0030498 0.1603861 -0.330903 0.4297484 0.0234734 0.0929147 -0.380315 -0.0104933 -0.0001938 -0.0065889 -0.154573 0.673224 -0.2876735 -0.0123973 -0.3758333 1.3746986 0.0502372 -0.0159178 0.0515283 0.4143912 -0.2140587 -0.1177292 -0.0088199 -0.0348462 -0.2552618 -0.0077927 -0.0038606 -0.0095206 -0.1357924 -0.2694156 0.1143406 0.0033645 0.0074402 -0.1218312 0.000008 -0.0024172 0.0030702 -0.1220765 0.3173137 -0.0393254 -0.001926 -0.0685274 0.4009698 0.00423 -0.0039005 0.0048547 0.2819927 unknown
polarizability: 188.916761|1.7908373|158.3068363|2.8363355|5.7217981|64.4779026 unknown
InChI: InChI=1/C9H9BN/c10-8-5-1-3-7-4-2-6-11-9(7)8/h1-6,11H,10H2
charge 1 multiplicity 1
20 atoms
C  -2.31619859 -0.34012556 -0.02323502
C  -1.4176637 0.71275335 0.05957313
C  -0.03777178 0.36050603 0.06715772
C  0.39634493 -0.98188666 -0.00548018
C  -0.58345874 -2.00649167 -0.08919703
C  -1.91228546 -1.68988188 -0.09758796
H  -3.37628861 -0.1128561 -0.03106799
C  1.77931454 -1.25320069 0.00905062
H  -0.25584703 -3.03845164 -0.14378146
H  -2.65948551 -2.47054593 -0.16039463
C  2.69828303 -0.23164766 0.0925184
C  2.23422785 1.0748208 0.16193923
H  2.11504025 -2.28251052 -0.04637952
H  3.76214946 -0.41977052 0.10559037
H  2.8912215 1.93155854 0.22882345
N  0.92920814 1.32506558 0.14693146
B  -1.94048572 2.16590964 0.13328524
H  -1.19927599 3.1035203 0.19871535
H  -3.11345842 2.35790257 0.12298221
H  0.61339788 2.28912205 0.19758261
