program: Gaussian 16
title: h_xanthene_prot
version: AS64L-G16RevC.02
method: RwB97XD
basis: GenECP
operation: Freq
keyword: #N
keyword: Geom=AllCheck
keyword: Guess=TCheck
keyword: SCRF=Check
keyword: GenChk
keyword: RwB97XD/GenECP
keyword: Freq
converged: YES YES YES YES
title: Mulliken charges:
elementType: C C C C C C H H H C O C H H H C H H H C C C C C H C H H B N C H H H C H H H H H H
charge: 0.357328 -0.145296 -0.734004 -0.264615 0.418351 -0.141721 0.276734 0.259414 0.194660 -0.023293 -0.109342 -0.492361 0.175819 0.183963 0.209971 -0.789817 0.199152 0.197853 0.204908 0.226134 0.014611 -0.017558 0.408264 -0.576641 0.199354 -0.808669 0.283877 0.199648 -0.215097 0.164493 -0.428084 0.258457 0.235164 0.248363 -0.342307 0.232564 0.226933 0.255444 0.007165 0.032942 0.417238
chargesum: 1.00000
title: Mulliken charges with hydrogens summed into heavy atoms:
elementType: C C C C C C C O C C C C C C C C B N C C
charge: 0.357328 0.131438 -0.474590 -0.069955 0.418351 -0.141721 -0.023293 -0.109342 0.077392 -0.187905 0.226134 0.014611 0.181796 0.408264 -0.292764 -0.609021 -0.174989 0.581731 0.313901 0.372634
1716.lowfreq: -3.2370 -0.0007 -0.0005 -0.0005 21.2233 23.9234 44.2667 60.1214 90.9739
frequency: 41.8893 59.3216 90.8424 98.4848 145.1444 154.0601 161.0001 188.1717 233.7621 244.8719 270.8181 285.9815 290.7845 295.2054 304.6557 318.4354 323.1848 336.5289 349.0846 362.1576 386.7541 417.2187 438.7947 458.2589 518.2338 521.2167 549.3927 553.1415 566.8027 584.3747 600.5968 630.6504 654.7835 684.8481 744.0277 771.8233 782.4952 820.5504 824.9243 831.7874 857.0201 875.7693 901.4866 918.0594 951.0769 957.7320 968.7020 972.3697 1002.1728 1011.3383 1017.2739 1022.1906 1028.7605 1037.1837 1080.6235 1108.8712 1118.0407 1150.2221 1170.7153 1185.2436 1193.0067 1201.1382 1205.3018 1214.7351 1240.1489 1255.9778 1280.1103 1289.9238 1291.9330 1310.6328 1318.2246 1322.1868 1339.5754 1350.7848 1404.8865 1429.6474 1449.6792 1460.4296 1467.9887 1481.6053 1489.1616 1494.1108 1502.5442 1506.2578 1511.0143 1513.3655 1515.1886 1522.0061 1523.3339 1527.2350 1545.6940 1562.8349 1646.7143 1663.5738 1680.7250 1706.7618 2557.2473 2644.8080 3045.7452 3060.3660 3092.6706 3099.4969 3130.1432 3132.8825 3139.3544 3144.6143 3196.4128 3199.7860 3201.6626 3204.4221 3210.1392 3214.7157 3214.8304 3222.9800 3228.4590 3233.1932 3407.1703
redmass: 3.9940 3.5021 3.1177 3.4007 3.4133 3.2042 2.7502 2.7782 1.7104 1.9561 2.6635 1.5122 1.4365 1.4252 1.6987 1.7561 2.9358 1.4420 2.6008 1.8437 3.9851 3.3944 4.3412 3.4149 3.4222 4.3007 4.3100 4.0785 3.9710 4.2963 4.2839 3.8811 3.8655 6.3227 3.3776 2.1271 2.0668 1.8943 2.6642 4.1988 4.5204 1.6426 4.0315 3.0313 1.6320 1.4393 2.1586 1.4926 1.4585 2.1018 1.3763 1.3725 1.3479 2.2999 1.1515 1.9953 2.3530 1.9007 2.4728 2.7966 1.7165 1.6477 1.2830 1.3838 2.4464 1.8585 2.6462 2.0282 1.7706 2.0275 3.1095 2.5558 4.1881 5.1622 1.2273 1.2417 1.3048 2.3278 1.1622 1.0464 1.1371 1.0366 1.2532 1.2720 1.2452 1.2563 1.6471 1.1318 1.1575 1.9069 1.3995 1.5113 5.2161 7.3407 7.6964 6.4131 1.0610 1.1200 1.0341 1.0371 1.0313 1.0315 1.1039 1.1035 1.1019 1.1028 1.1085 1.0886 1.1088 1.1079 1.1028 1.0924 1.0922 1.0931 1.0955 1.0980 1.0759
irintensity: 0.2700 2.9831 0.6854 5.3400 3.3605 4.7204 0.4664 0.3011 0.5659 1.4788 3.9628 1.0007 0.5744 0.5877 0.7871 0.5059 0.7108 0.2654 0.1107 0.1210 2.6357 3.9775 4.6120 1.3746 2.5475 18.2202 11.3717 2.1895 4.3308 2.2181 1.5715 1.9008 2.2079 1.4004 6.7470 13.1213 71.1818 17.6987 19.4744 7.7563 0.8602 33.2295 19.0486 4.9894 2.1451 4.8512 18.0234 10.7589 38.8707 11.0429 0.1647 0.4910 0.3060 19.0883 2.3740 21.5712 15.9941 24.0199 5.1601 13.4741 19.9712 27.5027 0.1548 7.5270 69.6179 66.4687 42.5008 112.0913 3.2024 99.5856 57.3612 67.7820 81.1781 7.0902 10.7193 17.5504 94.6491 369.2455 11.0953 0.3252 25.9527 1.0461 19.4035 7.3928 36.5456 46.9585 4.4179 18.2159 19.5085 18.5149 6.3531 95.4155 44.1928 44.0509 87.4076 2.2109 268.0432 209.7368 21.9778 14.4846 4.9655 1.6707 21.5665 14.6388 28.7139 22.0699 2.2268 1.2872 1.2921 2.3183 0.7411 5.9967 0.3274 1.9707 9.9031 2.2984 252.4641
temp: 298.150 k
press: 1.00000 atm
elementType: 6 6 6 6 6 6 1 1 1 6 8 6 1 1 1 6 1 1 1 6 6 6 6 6 1 6 1 1 5 7 6 1 1 1 6 1 1 1 1 1 1
symmnumber: 1
zpe: 922497.0 jmol-1
zpe.correction: 0.351361 hartree
zpe.thermalcorrener: 0.369230 hartree
zpe.thermalcorrenthalpy: 0.370175 hartree
zpe.thermalcorrgfe: 0.307301 hartree
zpe.sumelectzpe: -814.676958 hartree
zpe.sumelectthermal: -814.659088 hartree
zpe.sumelectthermalent: -814.658144 hartree
zpe.sumelectthermalfe: -814.721018 hartree
dipole: 8.5330 -0.1914 0.0699
dipole: 8.5354
quadrupole: -55.6598 -98.9670 -114.0872
quadrupole: 6.2458 3.2942 0.8103
quadrupole: 33.9116 -9.3957 -24.5159 6.2458 3.2942 0.8103
hfenergy: -815.0283186 hartree
pointgroup: C01 [X(C17H21B1N1O1)]
dipole: 3.396977 -0.0830721 0.0450654 debye
polarizability: 290.1590204|-0.5772734|284.5430469|9.0982732|5.0405407|158.6264299 unknown
InChI: InChI=1/C17H21BNO/c1-17(2)11-7-5-9-13(18)15(11)20-16-12(17)8-6-10-14(16)19(3)4/h5-10,19H,18H2,1-4H3
charge 1 multiplicity 1
41 atoms
C  -1.29549455 2.48024967 -0.11770597
C  -2.59852842 2.82585408 -0.51365927
C  -3.56543084 1.85783935 -0.72939766
C  -3.25493869 0.51680221 -0.5354293
C  -1.98818532 0.11007588 -0.11527256
C  -1.04630012 1.11374993 0.07625243
H  -2.83636055 3.8730409 -0.66387871
H  -4.56260833 2.13750689 -1.04611118
H  -4.02570258 -0.22457089 -0.70551092
C  -1.63336839 -1.34089191 0.21826506
O  0.22759292 0.77303783 0.49277362
C  -2.49695998 -2.34005608 -0.55630847
H  -2.2343083 -3.36438524 -0.28606638
H  -3.55045489 -2.21961413 -0.30065425
H  -2.38300812 -2.22144721 -1.63654236
C  -1.84905611 -1.55181647 1.73575496
H  -2.89702361 -1.37497015 1.9898308
H  -1.58930304 -2.57596234 2.01547191
H  -1.23560034 -0.86647188 2.32551288
C  -0.15037156 -1.5370357 -0.0771447
C  0.6915934 -0.45114867 0.12036643
C  0.44655196 -2.73492704 -0.46093427
C  2.06493288 -0.55067279 -0.05163342
C  1.82477897 -2.8452216 -0.61686152
H  -0.16727986 -3.60915144 -0.63517601
C  2.65271499 -1.75024399 -0.40855205
H  2.25852587 -3.7943561 -0.90423863
H  3.72440505 -1.84121137 -0.53583961
B  -0.2174205 3.56832332 0.01877326
N  2.83038736 0.68459289 0.17796741
C  3.48114695 0.69872935 1.52672874
H  4.2260909 -0.09369985 1.55842197
H  3.94825356 1.67097064 1.67541352
H  2.71279371 0.52655208 2.27746971
C  3.79398387 1.00699325 -0.91727245
H  4.19336464 2.00328459 -0.73708423
H  4.60204029 0.27896872 -0.90607435
H  3.26471527 0.97168697 -1.8667986
H  0.93431977 3.3052569 0.22335154
H  -0.52500077 4.71390597 -0.10738347
H  2.11826449 1.42615142 0.19130009
