program: Gaussian 16
title: Me_iPr-H+ restart2
version: ES64L-G16RevC.01
method: RwB97XD
basis: GenECP
operation: Freq
keyword: #N
keyword: Geom=AllCheck
keyword: Guess=TCheck
keyword: SCRF=Check
keyword: GenChk
keyword: RwB97XD/GenECPFreq
converged: YES YES YES YES
title: Mulliken charges:
elementType: C C C C C C H H H H N B C H H H C H H H C C C H H H H H H C C C H H H H H H H H H
charge: -0.493724 -0.533926 0.759276 0.646576 -0.490026 -0.443617 0.266782 0.243422 0.236473 0.273274 -0.087288 -0.823999 -0.400480 0.243097 0.243747 0.228951 -0.322017 0.213892 0.247700 0.245985 -0.023855 -0.615149 -0.720600 0.215613 0.182713 0.224627 0.163522 0.168789 0.187855 -0.113452 -0.564105 -0.441439 0.205751 0.202646 0.203434 0.192628 0.201309 0.158258 0.227540 0.221544 0.468276
chargesum: 1.00000
title: Mulliken charges with hydrogens summed into heavy atoms:
elementType: C C C C C C N B C C C C C C C C
charge: -0.226942 -0.290504 0.759276 0.646576 -0.253553 -0.170343 0.380988 -0.823999 0.315316 0.385560 0.203685 0.007803 -0.200435 0.108092 0.047725 0.110756
1716.lowfreq: -27.4081 -8.8396 -0.0005 -0.0005 -0.0004 16.9126 62.5957 76.6406 85.0664
frequency: 58.2457 75.9517 82.9797 89.4527 98.0922 120.9666 132.9256 162.9441 169.3859 195.8556 221.6485 229.2125 251.0888 261.1894 271.0532 283.0939 300.8236 317.7103 341.0318 364.8474 375.2080 388.4721 408.7808 437.6112 505.9808 536.6120 550.7180 567.3704 610.7686 673.5773 697.4743 773.1909 777.9103 801.8131 858.6077 870.8952 910.1246 917.4300 934.9268 938.9154 948.4318 962.1660 987.8888 990.2047 1005.7668 1021.8744 1043.2840 1063.8634 1068.0791 1076.6992 1081.1972 1097.4275 1115.9607 1150.9988 1164.6484 1185.1764 1189.0978 1205.5150 1212.6733 1229.2689 1253.7492 1276.8105 1304.0025 1309.7697 1318.6470 1336.9953 1361.7992 1382.1478 1401.4671 1409.4034 1421.7277 1426.8579 1433.2265 1444.3192 1450.9631 1484.2864 1485.5731 1490.9397 1493.3249 1494.6618 1499.5104 1504.2328 1505.4701 1507.7320 1513.4746 1515.6835 1521.2456 1531.2523 1544.0514 1548.2314 1641.0692 1688.3864 3012.8467 3028.2698 3037.5217 3038.2354 3041.3571 3057.2063 3092.0694 3093.1566 3101.9544 3108.2085 3109.3070 3112.7031 3114.7490 3118.2217 3120.7295 3122.9483 3191.4379 3195.0658 3206.8819 3207.9382 3209.0668 3216.1627 3223.5608 3231.6107 3474.2301
redmass: 3.0513 2.6673 2.7850 3.0481 2.8059 2.5994 3.1856 2.8849 1.5725 2.0554 2.2532 2.0027 1.5829 1.4533 1.1950 1.8870 1.8951 1.1696 3.0983 2.6254 1.3149 2.2924 2.3285 2.7258 3.1170 3.5202 2.8437 3.3061 3.6910 4.4000 5.6641 3.5784 4.0941 1.4021 3.1687 2.6264 2.2880 1.3585 2.6848 1.2356 1.3097 1.5594 1.3477 1.3613 1.3972 2.0335 1.3259 1.4010 1.7987 1.7922 2.6523 2.4268 2.0885 1.8742 1.7169 1.8962 1.8044 1.1670 1.8072 1.5398 2.2670 1.7710 1.7073 1.7521 1.3467 2.3097 1.6427 1.4879 1.2156 1.2830 1.2393 1.2198 1.1988 1.2785 1.1576 1.0589 1.0448 1.5478 1.1108 1.0993 1.1423 1.0593 1.0589 1.0638 1.0444 1.1650 1.0623 1.0928 1.8171 1.0490 5.4355 5.8361 1.0808 1.0363 1.0344 1.0355 1.0366 1.0822 1.0318 1.0325 1.0994 1.1012 1.1021 1.1011 1.1024 1.1019 1.1031 1.1015 1.1086 1.1087 1.0990 1.0966 1.1056 1.0907 1.0942 1.0991 1.0762
irintensity: 0.7305 0.7350 1.8555 1.6406 0.1854 2.5330 4.1808 3.4728 0.3090 0.2614 0.6535 0.3199 0.2470 0.2766 0.6508 0.1230 0.4855 0.0864 1.6173 0.8578 0.0539 2.7464 0.0481 0.0553 2.5636 9.7907 8.7845 12.7787 1.1275 3.0244 34.4017 10.9064 1.4290 50.9664 5.1795 7.5001 47.8948 12.3242 14.0451 18.9728 14.6214 77.0909 0.3100 0.4011 0.8776 22.9312 0.2531 2.8286 1.4773 7.4829 9.2511 0.2859 10.6636 5.8404 17.5622 5.0858 3.5051 1.4583 7.3828 7.5826 84.9960 3.5273 9.0800 10.4016 10.7015 9.2620 26.9985 13.2299 0.9658 17.6619 12.0232 7.7616 5.7147 28.5575 10.4130 2.4184 1.3028 8.7951 13.8345 6.2545 9.1293 2.8508 7.2239 11.9252 13.0424 33.0734 34.7530 26.0176 25.8785 17.1285 3.5452 23.8590 54.9427 29.0836 21.3537 38.3598 26.8048 13.1737 1.5082 4.4688 46.0205 37.3474 35.8311 19.9188 26.0373 34.7061 4.4327 58.7830 0.9051 2.8056 0.0724 0.0875 1.3401 2.3487 6.2207 3.0315 148.3839
temp: 298.150 k
press: 1.00000 atm
elementType: 6 6 6 6 6 6 1 1 1 1 7 5 6 1 1 1 6 1 1 1 6 6 6 1 1 1 1 1 1 6 6 6 1 1 1 1 1 1 1 1 1
symmnumber: 1
zpe: 982921.0 jmol-1
zpe.correction: 0.374375 hartree
zpe.thermalcorrener: 0.392400 hartree
zpe.thermalcorrenthalpy: 0.393344 hartree
zpe.thermalcorrgfe: 0.330136 hartree
zpe.sumelectzpe: -627.568430 hartree
zpe.sumelectthermal: -627.550404 hartree
zpe.sumelectthermalent: -627.549460 hartree
zpe.sumelectthermalfe: -627.612668 hartree
dipole: 7.4972 19.3604 1.8019
dipole: 20.8393
quadrupole: -68.5377 1.5550 -91.7240
quadrupole: 28.6318 2.0822 10.1575
quadrupole: -15.6355 54.4572 -38.8217 28.6318 2.0822 10.1575
hfenergy: -627.9428045 hartree
pointgroup: C01 [X(C14H25B1N1)]
dipole: -0.9025056 2.537641 0.7118446 debye
polarizability: 225.4488438|1.3383069|207.3761411|-2.0509146|9.8609032|169.6736079 unknown
InChI: InChI=1/C14H25BN/c1-11(2)15(12(3)4)13-9-7-8-10-14(13)16(5)6/h7-12,16H,1-6H3
charge 1 multiplicity 1
41 atoms
C  -0.78213834 1.09312682 -0.1001694
C  0.59966262 1.02866828 -0.21129098
C  1.41126303 2.15909206 -0.0333647
C  0.73905772 3.34666285 0.25595888
C  -0.64043812 3.45072445 0.33143436
C  -1.40636879 2.30739363 0.15651908
H  -1.37521734 0.19577106 -0.22916494
H  1.06268077 0.07424023 -0.42959216
H  -1.1265629 4.40005627 0.52240831
H  -2.48556245 2.36959057 0.2201531
N  1.5439988 4.57966717 0.45760063
B  2.98968289 2.02028382 -0.08982557
C  1.27243479 5.25173251 1.76696939
H  1.36315631 4.51188734 2.55934745
H  1.99891805 6.05119156 1.90192602
H  0.26688392 5.66537347 1.75388498
C  1.43377184 5.52811327 -0.69450304
H  1.69052561 4.99194798 -1.60538159
H  0.409297 5.88990826 -0.74915943
H  2.12085283 6.35689629 -0.53154442
C  3.71934925 1.54293892 -1.3985896
C  3.84583294 2.8416551 -2.23571355
C  3.06546954 0.44576284 -2.24271787
H  2.86108511 3.18983272 -2.56695603
H  4.34473333 3.65326988 -1.69511574
H  4.43669454 2.64695949 -3.13484773
H  3.66071009 0.25526745 -3.14061538
H  2.98887271 -0.49801035 -1.69572139
H  2.06132406 0.73106596 -2.56987386
C  3.81803777 2.39074925 1.20665021
C  3.97017871 0.99016484 1.86336718
C  5.19008659 3.04656726 1.02250047
H  4.57328293 0.32650599 1.23740862
H  4.477143 1.0919367 2.82648998
H  3.00554619 0.50758162 2.0465984
H  5.71629848 3.11045807 1.97915897
H  5.82034042 2.47193553 0.33919714
H  5.11581913 4.06285594 0.62151566
H  4.73757597 1.22231229 -1.15189271
H  3.23803093 2.98395824 1.92815321
H  2.51653172 4.26867916 0.50080289
