program: Gaussian 16
title: MeQHBiPr-H+
version: ES64L-G16RevC.01
method: RwB97XD
basis: GenECP
operation: Freq
keyword: #N
keyword: Geom=AllCheck
keyword: Guess=TCheck
keyword: SCRF=Check
keyword: GenChk
keyword: RwB97XD/GenECPFreq
converged: YES YES YES YES
title: Mulliken charges:
elementType: C H C N N N B H C H H H C C C H H H H H H C C C H H H H H H H H
charge: -0.237523 0.323010 -0.386221 0.347541 -0.033953 -0.068873 0.300727 0.455872 -0.398162 0.235054 0.247962 0.225146 0.185726 -0.689094 -0.759786 0.155127 0.183341 0.200239 0.164875 0.191946 0.147279 -0.138473 -0.607490 -0.617095 0.199526 0.166520 0.174988 0.189401 0.169676 0.169013 0.225868 0.277833
chargesum: 1.00000
title: Mulliken charges with hydrogens summed into heavy atoms:
elementType: C C N N N B C C C C C C C
charge: 0.085487 -0.386221 0.347541 -0.033953 0.386998 0.300727 0.310001 0.411593 -0.150388 -0.255686 0.139361 -0.066457 -0.089005
1716.lowfreq: 0.0005 0.0006 0.0006 4.4432 16.3794 30.9313 59.3593 90.0772 102.3052
frequency: 58.0618 89.1713 101.9192 115.9486 138.5313 149.1636 176.4849 184.4385 211.0535 236.8003 246.0143 286.8351 293.9930 303.2309 311.4619 338.6126 377.1220 398.6087 424.4072 475.9616 510.1581 658.2068 697.4500 713.8398 728.9608 781.8092 844.9898 867.2074 889.8023 919.3009 933.1466 947.0773 973.5867 983.7669 993.0117 1022.8368 1060.9345 1092.2261 1094.6042 1105.1104 1114.9517 1147.3231 1162.1265 1198.7421 1207.4276 1231.1661 1277.2679 1281.5427 1294.6692 1328.6967 1354.6923 1382.8690 1404.3028 1411.3509 1421.1081 1423.9653 1427.8980 1443.4938 1467.5073 1487.7231 1491.3791 1495.6107 1499.9118 1504.4500 1509.3149 1512.7380 1514.8370 1519.3999 1522.8032 1540.6469 1635.1625 2912.1318 3032.0231 3034.3173 3037.0328 3049.7024 3068.5708 3096.5874 3103.9945 3107.7858 3112.4570 3113.3530 3117.3619 3121.9598 3125.8423 3142.0478 3193.4239 3213.4296 3330.5676 3653.1357
redmass: 2.9475 3.2635 2.9327 2.7566 3.1977 1.1641 3.0195 2.0852 1.5955 2.6433 1.2534 1.6599 1.6180 1.9528 2.1809 2.5722 1.3945 2.0549 2.8158 2.6724 3.1751 4.8936 4.9156 5.9772 4.3358 1.1367 3.4288 2.7878 1.3370 1.4369 1.2119 1.4601 1.3663 1.3156 1.4221 2.1619 2.4178 2.3872 2.2929 2.2974 2.3276 2.0291 1.3641 1.7277 1.5788 1.6638 1.6983 1.9150 1.5073 1.9378 5.8815 1.6204 1.3326 1.2498 2.3617 1.4283 1.2177 2.5198 1.4636 1.0526 1.0528 1.0955 1.1662 1.3169 1.0612 1.2234 1.1524 1.0660 1.0496 1.1969 3.1250 1.0773 1.0412 1.0358 1.0358 1.0370 1.0832 1.0314 1.0949 1.1010 1.1003 1.1027 1.1022 1.1024 1.1020 1.1005 1.1082 1.1073 1.1017 1.0836
irintensity: 0.3048 0.7371 0.1927 0.2598 0.3488 0.1144 0.7151 1.5506 1.4311 1.6046 0.2319 0.7639 1.8239 1.2023 0.1536 5.0716 1.0657 1.4593 3.5620 2.0958 0.3443 2.6309 14.9112 1.0022 21.6471 89.2603 25.8268 19.9643 38.2082 14.8974 20.7757 24.4029 31.0192 10.2259 1.3062 56.4979 0.4571 1.5663 14.7977 14.0412 14.6912 0.6005 2.6603 34.2698 1.1207 122.5563 17.7466 67.0320 7.9989 10.6372 8.2754 10.9270 6.0298 4.6160 10.8185 3.3227 3.9931 4.3922 13.5544 0.9578 21.5989 6.2516 1.8701 15.5820 12.5300 4.1683 21.6896 26.8044 28.7795 3.7661 8.4647 31.4223 31.7843 28.2828 33.3763 29.9135 7.5402 2.0225 30.6739 19.8018 55.4799 26.8479 33.6396 14.7648 38.1709 26.4749 0.0227 0.5692 17.7808 194.9780
temp: 298.150 k
press: 1.00000 atm
elementType: 6 1 6 7 7 7 5 1 6 1 1 1 6 6 6 1 1 1 1 1 1 6 6 6 1 1 1 1 1 1 1 1
symmnumber: 1
zpe: 750756.3 jmol-1
zpe.correction: 0.285948 hartree
zpe.thermalcorrener: 0.300668 hartree
zpe.thermalcorrenthalpy: 0.301612 hartree
zpe.thermalcorrgfe: 0.245351 hartree
zpe.sumelectzpe: -542.991973 hartree
zpe.sumelectthermal: -542.977253 hartree
zpe.sumelectthermalent: -542.976309 hartree
zpe.sumelectthermalfe: -543.032570 hartree
dipole: 12.5831 4.6106 3.0584
dipole: 13.7458
quadrupole: -26.6065 -60.7626 -68.5489
quadrupole: -0.4322 8.5369 -0.5540
quadrupole: 25.3662 -8.7900 -16.5762 -0.4322 8.5369 -0.5540
hfenergy: -543.2779209 hartree
pointgroup: C01 [X(C9H19B1N3)]
dipole: -1.6799905 1.4355285 -0.864646 debye
polarizability: 151.4373691|-27.1995118|146.7680553|1.2984229|-9.010302|151.9574208 unknown
InChI: InChI=1/C9H19BN3/c1-7(2)10(8(3)4)9-6-13(5)12-11-9/h6-8,11H,1-5H3
charge 1 multiplicity 1
32 atoms
C  1.93829234 1.10913258 1.05611748
H  1.21682717 0.96154795 1.84067671
C  3.14547285 0.49750528 0.80115538
N  1.74414412 2.01475865 0.06782999
N  2.73137026 2.03515196 -0.78201033
N  3.54802635 1.12074934 -0.34267645
B  3.95963732 -0.64756866 1.55332295
H  4.39900411 0.95746408 -0.86631884
C  0.59578057 2.90155062 -0.12296905
H  0.86569124 3.6351425 -0.87772232
H  -0.2558985 2.31056158 -0.45583534
H  0.37431941 3.39289332 0.82233032
C  4.10727767 -0.54115659 3.11204098
C  5.34362112 0.37224166 3.31856823
C  2.92093172 -0.00311117 3.91902936
H  6.24015211 -0.01407451 2.82718937
H  5.15521094 1.38426959 2.94378595
H  5.56315421 0.45602944 4.38629754
H  2.00605345 -0.57847109 3.74763028
H  3.14093789 -0.05641445 4.98859592
H  2.72203311 1.04901386 3.69253716
C  4.57946888 -1.83428566 0.73200053
C  5.90102931 -2.39633307 1.28192889
C  4.64355822 -1.72884684 -0.79726863
H  6.72880583 -1.71499133 1.06268719
H  5.8756913 -2.55672578 2.36080149
H  6.13223458 -3.35410656 0.80936811
H  4.89512557 -2.69728089 -1.23598153
H  3.69579214 -1.41330933 -1.24120676
H  5.43264576 -1.03653204 -1.11613088
H  4.36461306 -1.5289779 3.50755066
H  3.79800819 -2.58824829 0.96709812
