program: Gaussian 16
title: H_Me-H+
version: ES64L-G16RevC.01
method: RwB97XD
basis: GenECP
operation: Freq
keyword: #N
keyword: Geom=AllCheck
keyword: Guess=TCheck
keyword: SCRF=Check
keyword: GenChk
keyword: RwB97XD/GenECPFreq
converged: YES YES YES YES
title: Mulliken charges:
elementType: C C C C C C H H H H N B H C H H H C H H H H H
charge: -0.299754 0.005484 0.484633 -0.645609 -0.066130 -0.366518 0.261813 0.250206 0.233016 0.265712 -0.166036 0.333568 0.367442 -0.831990 0.165107 0.194820 0.214188 -0.723000 0.199084 0.183214 0.166924 0.409003 0.364822
chargesum: 1.00000
title: Mulliken charges with hydrogens summed into heavy atoms:
elementType: C C C C C C N B C C
charge: -0.037941 0.255689 0.484633 -0.645609 0.166886 -0.100806 0.975232 0.333568 -0.257875 -0.173777
1716.lowfreq: -39.0208 -30.1674 0.0003 0.0008 0.0008 36.8137 75.2550 105.8593 140.6131
frequency: 69.7131 105.3305 139.7804 164.1202 199.4052 222.4266 285.2968 311.1385 346.6432 372.9730 429.8440 467.4850 493.1202 524.3667 566.4826 665.0584 701.9036 735.2586 788.0855 805.5973 848.4777 856.0836 907.7479 926.0182 1008.7847 1037.4983 1043.2189 1047.8826 1086.0883 1105.1565 1134.3690 1161.9637 1207.1872 1208.3348 1259.0173 1315.4770 1336.5527 1348.9219 1358.7539 1444.9294 1460.1624 1479.5466 1486.9258 1504.7518 1533.2386 1555.2634 1638.2074 1651.8354 1676.3472 1701.8105 2999.6798 3012.5357 3073.5980 3093.5220 3114.6077 3138.7791 3197.6330 3207.4498 3220.0204 3232.7442 3437.8153 3509.3419 3535.6086
redmass: 2.7232 3.5354 1.0805 1.0474 3.3892 2.6991 1.5884 2.6177 1.7684 2.1591 2.6984 2.7416 3.0398 3.2979 5.1403 2.3188 1.7771 3.9195 1.1977 3.5079 1.3951 1.9706 1.4902 1.7998 1.3618 2.2377 1.7330 1.3484 2.5504 1.4047 2.1888 2.6129 1.1669 1.9566 2.8792 2.3030 1.3374 1.6930 1.8188 1.0498 1.0542 1.1171 1.9944 1.1108 1.7971 1.3571 3.7895 1.1828 1.8053 1.6802 1.0485 1.0503 1.0908 1.0812 1.0952 1.1032 1.0916 1.0891 1.0937 1.0987 1.0332 1.0900 1.0926
irintensity: 3.8273 0.5450 0.7044 0.5448 13.0356 17.2368 1.9121 17.3072 1.2191 3.6365 0.1186 18.6060 15.9345 8.6601 3.8524 7.4628 8.3018 1.2094 73.2642 1.9690 1.4135 5.8143 13.5680 17.2661 0.5432 1.8543 63.5470 0.1981 8.7930 17.6475 36.3346 23.1913 9.5379 8.1584 208.4489 1.3978 107.6490 119.3402 21.1499 0.3433 4.6142 13.3270 54.7854 18.4732 81.0531 57.3427 8.4927 36.2640 87.0632 7.5921 10.7313 2.5203 22.8795 12.5990 14.6573 17.9295 2.3674 0.3755 3.2609 2.4626 101.9423 218.0749 123.0570
temp: 298.150 k
press: 1.00000 atm
elementType: 6 6 6 6 6 6 1 1 1 1 7 5 1 6 1 1 1 6 1 1 1 1 1
symmnumber: 1
zpe: 529335.1 jmol-1
zpe.correction: 0.201613 hartree
zpe.thermalcorrener: 0.212104 hartree
zpe.thermalcorrenthalpy: 0.213048 hartree
zpe.thermalcorrgfe: 0.166249 hartree
zpe.sumelectzpe: -391.880229 hartree
zpe.sumelectthermal: -391.869738 hartree
zpe.sumelectthermalent: -391.868794 hartree
zpe.sumelectthermalfe: -391.915593 hartree
dipole: 6.5831 18.3450 -1.0907
dipole: 19.5209
quadrupole: -33.8570 28.1301 -57.4907
quadrupole: 25.5750 -3.9094 -10.2125
quadrupole: -12.7844 49.2026 -36.4182 25.5750 -3.9094 -10.2125
hfenergy: -392.0818419 hartree
pointgroup: C01 [X(C8H13B1N1)]
dipole: 0.05677 2.6968288 -0.9655807 debye
dipolederiv: -0.0168239 0.1325452 -0.0634129 0.1062333 0.0428889 -0.0510921 -0.0331836 -0.0700752 -0.068721 -0.0231799 -0.0860748 0.0409532 -0.0255117 0.0684371 -0.0788147 -0.1063787 -0.0522276 -0.0686212 -0.9419702 0.0612279 0.092572 0.1021032 -0.2788441 0.0702867 0.0222318 0.0838337 -0.1799184 0.488732 0.2032518 -0.142149 0.0620522 0.5321842 -0.2096867 0.0641177 -0.1809565 -0.0065282 -0.3095785 -0.0461786 0.0331841 -0.1297162 -0.0408435 -0.0030558 0.0806198 -0.0188677 -0.1114619 0.134489 -0.0127646 -0.0175938 0.0987037 -0.0403468 -0.0438675 -0.0593224 -0.0282657 -0.0890202 0.0487328 -0.0480832 0.0311416 -0.0561848 0.024636 0.0558257 0.0383241 0.0524989 0.1308426 0.0908462 0.0597111 -0.0147415 0.0537387 0.0131539 0.0430847 -0.0084794 0.0468476 0.1059105 0.0905505 0.0301049 -0.0018345 0.0362678 -0.0222394 0.0700603 -0.0161948 0.0694917 0.1418398 -0.0219982 0.0097483 0.0123281 0.0136151 0.102423 0.0184683 0.0074476 0.0196073 0.1450103 -0.3282849 -0.127588 0.1135955 -0.0925325 -0.4481593 0.134694 0.0663373 0.043313 -0.0969105 1.663201 -0.1635612 -0.1343702 -0.2035131 0.7277667 -0.311474 -0.0999228 -0.3357313 0.757845 0.4230506 -0.1231254 -0.0559825 -0.1481152 0.2973578 -0.0031118 -0.0914572 0.0212457 0.2435245 -0.5392537 -0.1037269 0.2746024 -0.1590751 -0.3211068 0.1618585 0.2101663 0.105182 -0.2910153 0.0125232 0.0635144 -0.1134359 0.066452 0.0376933 0.0661187 -0.1301383 0.1072786 -0.0679448 0.0990134 -0.0409848 -0.04475 -0.0512993 -0.0342992 -0.0529764 0.0104229 -0.0561709 0.0450619 -0.0117429 0.0827914 0.0236935 0.1055598 0.0554745 -0.0373349 0.0371222 0.0024287 0.0814456 -0.344297 0.1831576 -0.1321475 0.3663574 -0.5095857 0.2342203 -0.0523733 0.1407529 -0.2451113 0.0901381 -0.0114188 -0.0012525 -0.0132274 0.0028121 -0.0850894 -0.0505096 -0.0356394 0.034238 -0.116069 -0.03879 -0.0165888 -0.0650414 0.1172345 -0.0178106 -0.0381751 0.0148745 0.0742442 0.0444529 -0.0195622 0.0912016 -0.0417657 0.0954141 0.023785 0.0879626 0.0330198 -0.0737672 0.2383155 -0.0023946 0.0206769 -0.0029411 0.2840283 0.0605401 0.039005 0.0934004 0.2490511 0.229153 -0.0017997 0.0043103 -0.02216 0.2939204 -0.0446286 0.0223779 -0.0558404 0.2900065 unknown
polarizability: 155.3709972|-5.2530956|123.7791323|-7.6531857|-20.4148827|88.9794359 unknown
InChI: InChI=1/C8H13BN/c1-9(2)7-5-3-4-6-8(7)10/h3-6H,1-2,10H3
charge 1 multiplicity 1
23 atoms
C  -0.71213234 1.18521589 0.99343294
C  0.67133191 1.09943547 0.90373928
C  1.45879699 2.14743862 0.40147656
C  0.74665399 3.28819187 0.02291531
C  -0.62519482 3.42143168 0.1254926
C  -1.36381758 2.3485986 0.60961252
H  -1.28094863 0.34563749 1.3737966
H  1.15919869 0.18569102 1.22209996
H  -1.12380637 4.3401074 -0.16435948
H  -2.44066085 2.43069034 0.6881752
N  1.49001188 4.47276681 -0.47404181
B  3.01971603 1.90969796 0.26063449
H  2.32384396 4.18746284 -0.99632182
C  3.88762033 2.60117443 -0.86438591
H  3.37101632 2.86162656 -1.79649032
H  4.36085619 3.50877113 -0.45874319
H  4.7263317 1.95941949 -1.14695162
C  3.72998732 0.90739957 1.22775446
H  3.72374627 -0.07284363 0.72511019
H  4.78570184 1.15084198 1.37446303
H  3.25205327 0.77012134 2.1996607
H  1.80053433 5.07328719 0.29332985
H  0.91205851 5.03998077 -1.0958406
