program: Gaussian 16
title: me_benzopiperidine_prot
version: AS64L-G16RevC.02
method: RwB97XD
basis: GenECP
operation: Freq
keyword: #N
keyword: Geom=AllCheck
keyword: Guess=TCheck
keyword: SCRF=Check
keyword: GenChk
keyword: RwB97XD/GenECPFreq
converged: YES YES YES YES
title: Mulliken charges:
elementType: H C C C C H C H H B H C H H H C H H H C N C C C H H C H H C H H H H H H
charge: 0.258087 -0.376517 0.064875 -0.496368 -0.001840 0.267710 -0.106138 0.276090 0.228511 0.288486 0.194376 -0.854843 0.201064 0.191081 0.252420 -0.759235 0.178651 0.192721 0.172135 0.159496 0.044433 -0.305520 -0.231512 -0.268195 0.263743 0.261663 -0.358781 0.286748 0.238143 -0.633899 0.270771 0.207065 0.262173 0.204449 0.252337 0.175619
chargesum: 1.00000
title: Mulliken charges with hydrogens summed into heavy atoms:
elementType: C C C C C B C C C N C C C C C
charge: -0.118429 0.332585 -0.220278 -0.001840 0.122372 0.288486 -0.210278 -0.215728 0.159496 0.238809 0.219886 0.293379 0.209641 0.107841 -0.205943
1716.lowfreq: -36.1539 -16.5515 -0.0005 -0.0003 0.0002 16.3132 57.2807 83.0316 97.0955
frequency: 50.7545 79.2574 96.7999 114.8610 126.4019 138.1560 190.8686 215.8450 245.0348 266.2134 278.5551 305.3610 323.5271 350.1491 382.2495 423.3377 457.6510 468.2667 487.9507 507.5192 550.2460 556.7293 642.7253 676.2022 716.3910 760.5532 786.7085 794.7241 816.4774 847.4637 852.3120 860.0387 890.1866 904.7069 918.9335 923.3198 933.4401 976.2205 1002.0502 1029.7062 1039.4885 1043.2557 1053.3032 1056.0037 1086.1169 1108.4566 1124.1283 1148.6791 1154.9703 1179.2707 1201.9997 1220.5130 1246.0580 1251.9045 1287.0460 1305.5268 1306.0480 1331.7064 1337.6690 1349.6491 1354.6832 1370.2870 1396.8873 1403.5262 1407.5181 1409.5464 1422.6082 1448.0013 1456.7750 1462.1775 1481.7864 1489.1115 1493.0645 1496.9983 1505.7914 1506.8294 1517.4841 1536.1938 1543.7344 1640.9818 1685.1128 3011.6974 3019.9852 3050.3274 3056.7164 3063.7217 3081.3825 3091.7379 3099.3783 3107.2176 3113.6793 3125.5723 3126.3335 3132.2499 3137.6583 3161.6146 3171.1520 3204.3729 3210.1618 3219.1803 3229.1284 3470.6555
redmass: 2.7052 2.8776 3.1528 3.1227 2.6386 1.3315 3.0202 1.1707 2.7728 2.1183 3.2432 2.7669 2.4053 2.1669 2.3353 2.4059 2.7532 3.1124 2.4903 2.7732 2.2287 2.8637 4.9765 1.9412 1.9248 3.0566 1.5612 2.2934 1.4702 2.4511 1.4333 2.1556 1.5324 1.4565 2.5324 2.0715 1.9178 1.4779 1.3881 2.7406 1.3999 2.8062 1.9143 2.7544 2.1926 1.8998 2.1054 1.1444 2.3122 2.1383 1.1517 2.0785 1.4674 2.8854 1.3586 2.2201 1.2130 1.8472 1.2806 1.4773 1.3845 1.2921 1.3710 1.4533 1.3940 1.4212 1.1718 1.0520 1.3592 1.0918 1.1240 1.2361 1.1266 1.4601 1.1953 1.1036 1.0597 2.0230 1.1220 5.5014 5.7507 1.0447 1.0469 1.0713 1.0676 1.0645 1.0908 1.0857 1.0607 1.0612 1.0976 1.0956 1.0947 1.0996 1.1021 1.1100 1.1091 1.0874 1.0901 1.0943 1.0994 1.0758
irintensity: 0.2588 0.2780 0.6921 0.2723 0.4853 0.5305 4.0498 0.2883 0.5470 0.3974 0.2949 2.6381 1.8313 2.6402 1.3619 0.9531 3.8888 4.0296 4.2900 11.3070 7.0139 10.1008 0.9500 5.5359 5.9897 18.4241 39.8846 10.0265 2.1524 2.0865 0.3005 1.6624 14.8678 9.5244 11.7671 16.7192 11.0779 7.2809 0.7562 35.6971 0.4740 22.5210 3.8003 20.5857 4.9362 1.2595 26.0393 6.9638 40.5125 8.7785 0.1937 25.0199 7.9075 179.2030 36.2069 1.7949 3.7908 9.3945 88.8756 123.6206 11.9007 5.0849 6.9560 0.0592 9.5030 7.0036 24.8817 3.8069 39.6915 9.6803 14.2243 17.1500 11.9485 2.1550 12.3939 8.2570 11.9920 25.5076 30.1225 11.6934 54.4282 10.7053 1.0972 6.6202 4.1539 38.4073 13.2817 16.1628 8.2080 4.3435 16.3383 13.2362 10.4597 18.6582 17.4168 5.9066 3.0168 1.2159 1.3812 7.1708 4.3796 177.6388
temp: 298.150 k
press: 1.00000 atm
elementType: 1 6 6 6 6 1 6 1 1 5 1 6 1 1 1 6 1 1 1 6 7 6 6 6 1 1 6 1 1 6 1 1 1 1 1 1
symmnumber: 1
zpe: 853491.9 jmol-1
zpe.correction: 0.325078 hartree
zpe.thermalcorrener: 0.339693 hartree
zpe.thermalcorrenthalpy: 0.340638 hartree
zpe.thermalcorrgfe: 0.284299 hartree
zpe.sumelectzpe: -587.121135 hartree
zpe.sumelectthermal: -587.106519 hartree
zpe.sumelectthermalent: -587.105575 hartree
zpe.sumelectthermalfe: -587.161914 hartree
dipole: 26.1795 0.2144 0.8737
dipole: 26.1950
quadrupole: 78.3626 -72.9202 -84.8731
quadrupole: -2.6760 4.9648 -3.7069
quadrupole: 104.8395 -46.4433 -58.3962 -2.6760 4.9648 -3.7069
hfenergy: -587.4462127 hartree
pointgroup: C01 [X(C13H21B1N1)]
dipole: 0.9955635 -0.7753318 0.1111926 debye
polarizability: 213.5414452|-2.663437|197.641071|-7.9317776|-13.8980025|139.2649129 unknown
InChI: InChI=1/C13H21BN/c1-14(2)12-8-4-5-9-13(12)15-10-6-3-7-11-15/h4-5,8-9,15H,3,6-7,10-11H2,1-2H3
charge 1 multiplicity 1
36 atoms
H  0.30944246 0.38705102 0.42982649
C  1.38764458 0.2978902 0.37652374
C  2.16208812 1.41042925 0.08015981
C  1.99828448 -0.92461406 0.62045557
C  3.56135516 1.34521467 -0.0198766
H  1.66804726 2.35978714 -0.09193515
C  3.38142732 -1.03064368 0.55694528
H  1.40529286 -1.7964334 0.86799036
H  3.8542774 -1.9828847 0.76491671
B  4.32801175 2.6591559 -0.46033748
H  5.95535287 0.84279112 -0.15679497
C  5.65353903 2.62454499 -1.32161999
H  6.52479516 2.77675422 -0.66457306
H  5.82626254 1.72961718 -1.92924956
H  5.67988471 3.48291532 -1.99909859
C  3.73271329 4.05672246 -0.08355988
H  4.50368593 4.82798679 -0.00312449
H  3.09077396 4.3709816 -0.92094865
H  3.11148707 4.07121392 0.81426137
C  4.12747041 0.08890998 0.22813147
N  5.59825216 -0.04827711 0.1929968
C  6.20733734 -0.23628306 1.56237485
C  6.08914211 -1.08534797 -0.78625046
C  7.72472378 -0.19060524 1.47265606
H  5.8026068 0.55404999 2.19454448
H  5.84925201 -1.19730483 1.93498836
C  7.6034756 -1.01743695 -0.89396357
H  5.59063077 -0.88168104 -1.73384413
H  5.75992666 -2.05646872 -0.4153799
C  8.26388341 -1.209884 0.47000495
H  8.12330851 -0.37358061 2.47220033
H  8.04380346 0.81918406 1.18825417
H  7.924113 -1.78528445 -1.60039457
H  7.89583731 -0.05207636 -1.32474086
H  9.34631268 -1.10716326 0.38022298
H  8.06751604 -2.22505035 0.83227512
