program: Gaussian 16
title: me_benzopyrrolidine_prot
version: AS64L-G16RevC.02
method: RwB97XD
basis: GenECP
operation: Freq
keyword: #N
keyword: Geom=AllCheck
keyword: Guess=TCheck
keyword: SCRF=Check
keyword: GenChk
keyword: RwB97XD/GenECPFreq
converged: YES YES NO YES
title: Mulliken charges:
elementType: H C C C C H C H C H B C H H H C H H H N C C C H H C H H H H H H H
charge: 0.256026 -0.334608 0.001117 -0.605213 -0.062728 0.260461 -0.184642 0.273993 0.375216 0.246396 0.323603 -0.742457 0.191951 0.172673 0.181135 -0.833332 0.207704 0.147441 0.247679 0.132981 -0.280371 -0.257342 -0.450999 0.242095 0.256234 -0.449155 0.236201 0.239307 0.210291 0.262271 0.242348 0.216925 0.276799
chargesum: 1.00000
title: Mulliken charges with hydrogens summed into heavy atoms:
elementType: C C C C C C B C C N C C C C
charge: -0.078582 0.261578 -0.331220 -0.062728 0.061754 0.375216 0.323603 -0.196698 -0.230507 0.409780 0.217959 0.218165 0.021563 0.010118
1716.lowfreq: -19.1080 -0.0002 0.0003 0.0005 12.0105 40.9766 70.1456 91.1081 92.7095
frequency: 69.5031 89.8188 91.8361 123.4809 146.2063 156.7696 184.9219 205.4147 241.9581 269.9950 301.4272 324.3408 346.2338 378.9998 441.7669 465.3425 501.0308 548.5320 551.2410 625.8668 649.9999 683.2221 722.2004 758.9015 788.9470 797.8590 820.8963 850.6120 853.7341 872.2270 907.6027 922.2936 929.0780 942.7666 976.9070 985.0685 1006.6076 1040.8799 1043.9336 1074.7645 1075.5649 1089.6653 1095.0746 1127.2141 1155.2985 1205.5889 1216.8392 1234.4088 1238.0349 1260.0398 1264.3727 1309.4145 1318.9426 1332.2380 1338.4293 1345.0597 1350.5529 1355.2282 1380.9604 1398.1738 1426.5026 1447.4842 1452.4110 1468.3487 1480.6325 1494.0829 1498.5754 1501.3639 1505.4633 1521.8976 1537.8484 1546.8065 1642.5237 1686.9861 3015.1711 3017.6955 3073.7468 3087.0538 3093.8101 3108.1173 3109.8307 3111.5934 3136.0768 3136.8877 3155.0257 3164.2235 3178.7909 3196.1915 3200.7586 3208.1969 3217.6932 3228.4664 3490.6088
redmass: 2.6575 2.5322 3.1354 2.7977 2.0717 1.3997 2.0758 2.4507 1.3127 2.7289 3.1592 3.9517 2.1768 2.6436 2.5340 2.8313 2.9166 2.3781 3.2608 2.5665 5.5474 1.9144 2.0833 3.2040 1.3051 1.2691 2.5384 1.5227 1.5841 2.6434 1.4536 2.6244 2.0043 2.9991 1.7679 1.7501 1.4102 2.9813 1.3902 2.4273 4.2615 2.2400 1.5362 2.2156 2.5463 1.1660 1.8562 1.3748 1.4325 2.1442 1.4466 2.0125 1.4111 1.4769 1.4616 1.3527 1.4339 1.3962 1.4183 1.3812 1.1527 1.1026 1.2019 1.1019 1.1210 1.2076 1.5517 1.1640 1.0956 1.1073 1.1292 1.8543 5.4438 5.6197 1.0449 1.0482 1.0705 1.0879 1.0835 1.0610 1.0625 1.0990 1.0625 1.1015 1.1007 1.1035 1.1093 1.1068 1.0912 1.0891 1.0938 1.0992 1.0755
irintensity: 0.6194 0.2459 0.5722 0.2351 0.5426 0.5821 0.4070 4.5072 1.0288 1.0059 1.1468 3.0440 1.3633 1.5235 0.1422 5.1123 10.8780 8.0541 10.4571 2.9781 2.6510 8.8903 3.4465 16.4694 35.6887 17.0547 4.8345 1.3294 2.7039 8.9651 14.5441 0.4119 29.1299 12.5974 0.6878 0.4964 0.5034 31.3454 3.2745 7.0604 13.4165 16.1906 1.2214 33.2578 35.6168 0.2841 21.0412 13.4560 43.8075 128.3656 47.7083 2.1751 13.5194 9.1259 106.6023 1.1777 114.8259 18.0260 4.6349 9.2308 18.4008 7.6795 24.5326 14.4629 14.2319 6.2429 22.3180 3.2738 11.2407 4.5481 16.0192 35.2966 13.1162 54.4965 7.2897 3.0455 11.3460 7.3276 16.2246 6.7031 14.4189 20.6707 6.1938 17.8635 2.4928 7.1086 3.6028 3.7389 2.5139 0.5275 4.4189 4.8478 216.1124
temp: 298.150 k
press: 1.00000 atm
elementType: 1 6 6 6 6 1 6 1 6 1 5 6 1 1 1 6 1 1 1 7 6 6 6 1 1 6 1 1 1 1 1 1 1
symmnumber: 1
zpe: 777125.0 jmol-1
zpe.correction: 0.295991 hartree
zpe.thermalcorrener: 0.309597 hartree
zpe.thermalcorrenthalpy: 0.310541 hartree
zpe.thermalcorrgfe: 0.256467 hartree
zpe.sumelectzpe: -547.826717 hartree
zpe.sumelectthermal: -547.813111 hartree
zpe.sumelectthermalent: -547.812167 hartree
zpe.sumelectthermalfe: -547.866241 hartree
dipole: 26.3548 0.4641 -0.4288
dipole: 26.3624
quadrupole: 85.2132 -65.1561 -80.1732
quadrupole: -1.1358 -4.4239 -2.2264
quadrupole: 105.2519 -45.1174 -60.1344 -1.1358 -4.4239 -2.2264
hfenergy: -548.1227088 hartree
pointgroup: C01 [X(C12H19B1N1)]
dipole: 1.3773068 -0.8946343 -0.0971336 debye
polarizability: 196.3191245|-1.4805845|190.2554111|-13.7779089|-6.1593873|124.6576325 unknown
InChI: InChI=1/C12H19BN/c1-13(2)11-7-3-4-8-12(11)14-9-5-6-10-14/h3-4,7-8,14H,5-6,9-10H2,1-2H3
charge 1 multiplicity 1
33 atoms
H  0.45131682 0.25462003 0.6106355
C  1.52261153 0.21041624 0.45651232
C  2.23923646 1.37657118 0.23324311
C  2.18376063 -1.0100378 0.5020767
C  3.62644935 1.37660035 0.00862509
H  1.70769656 2.32087896 0.22468178
C  3.55627266 -1.05710238 0.3042047
H  1.63813625 -1.92491812 0.6976698
C  4.24112482 0.11928286 0.04484893
H  4.07278291 -2.00883521 0.35750189
B  4.32670567 2.77006202 -0.27611013
C  3.67837656 4.07459585 0.29935123
H  2.96013513 4.43556073 -0.45321773
H  3.12028397 3.9455255 1.22911688
H  4.40511523 4.881845 0.42306537
C  5.63150495 2.93847662 -1.15323177
H  6.50054251 3.08988154 -0.49308651
H  5.86948354 2.15040136 -1.87509429
H  5.56665102 3.87114203 -1.72186672
N  5.70212078 0.03307294 -0.1381893
C  6.49117281 -0.38162865 1.07590448
C  6.19701664 -0.85101278 -1.2660264
C  7.88069366 -0.58806903 0.50224039
H  6.05267757 -1.30814796 1.44695752
H  6.39637592 0.3945844 1.833567
C  7.6212563 -1.26575568 -0.85746347
H  6.13956237 -0.27450392 -2.18785795
H  5.51777751 -1.69584948 -1.3470386
H  8.37907786 0.37649145 0.37179038
H  8.49974828 -1.19404341 1.16153422
H  8.3537563 -0.96299857 -1.60382317
H  7.67344036 -2.3503516 -0.76264492
H  6.01336606 0.97786553 -0.36677234
