program: Gaussian 16
title: me_cinnoline_prot
version: AS64L-G16RevC.02
method: RwB97XD
basis: GenECP
operation: Freq
keyword: #N
keyword: Geom=AllCheck
keyword: Guess=TCheck
keyword: SCRF=Check
keyword: GenChk
keyword: RwB97XD/GenECPFreq
converged: YES YES YES YES
title: Mulliken charges:
elementType: C C C C C C H H H B N C C H H H C H H H C H H H N
charge: -0.674396 -0.002147 -0.008478 -0.558399 -0.427996 0.423988 0.270229 0.290653 0.258505 0.349769 0.106565 0.961746 -0.694335 0.311597 0.311097 0.375209 -0.711145 0.203659 0.197096 0.153529 -0.816753 0.174379 0.198436 0.210680 0.096512
chargesum: 1.00000
title: Mulliken charges with hydrogens summed into heavy atoms:
elementType: C C C C C C B N C C C C N
charge: -0.674396 -0.002147 0.261751 -0.267746 -0.169491 0.423988 0.349769 0.481773 1.272843 -0.382737 -0.156860 -0.233259 0.096512
1716.lowfreq: -24.6960 0.0003 0.0006 0.0008 23.0104 30.1385 70.0984 87.2147 154.4470
frequency: 68.1224 87.0672 154.3984 169.2991 182.8131 194.5649 227.0326 287.1241 312.3144 364.0248 411.6329 439.4368 448.3242 477.7895 541.7102 544.3461 566.4733 657.4137 674.5876 710.9410 781.5131 806.2915 814.5744 831.2986 848.5860 870.8026 886.0487 916.6371 923.3515 1000.7498 1004.7424 1029.3477 1043.5556 1075.4144 1109.9448 1157.3110 1166.0599 1210.1142 1219.4767 1260.8517 1304.9865 1333.2920 1336.1832 1348.1796 1354.9951 1422.5888 1450.7902 1455.3509 1460.3123 1472.9660 1482.1937 1496.8041 1511.8850 1605.8453 1633.4956 1651.4113 1691.2503 3000.1576 3018.4618 3085.2309 3094.5662 3124.2350 3136.4293 3206.4166 3220.1351 3224.6124 3235.5320 3246.8450 3567.7629
redmass: 2.9581 3.5418 3.3462 2.3883 1.4054 2.8275 1.2576 2.7391 2.9013 2.6992 2.5093 3.2867 3.4712 3.6332 4.0750 6.9293 4.7448 5.0281 1.6315 2.8470 3.0765 2.0440 2.0484 3.6416 1.4344 1.2903 2.4321 1.7810 1.5573 1.3599 3.6672 1.3843 1.3686 2.9410 2.0107 2.5433 2.5374 1.5724 1.6573 2.5260 1.6643 2.2507 1.4777 1.6222 2.3677 4.9259 1.1437 1.6062 1.0652 1.8470 1.3497 1.0726 2.1269 2.7858 6.3020 3.4577 5.4017 1.0520 1.0482 1.0806 1.0839 1.1018 1.1027 1.0909 1.0919 1.0922 1.0985 1.0974 1.0810
irintensity: 0.3960 0.4235 1.4827 0.7720 0.4416 0.1722 0.3025 0.6806 0.1450 3.0728 10.5989 5.0241 5.1903 0.7203 3.2128 7.8688 7.0910 4.2795 6.2454 4.6516 8.2175 5.1105 2.8986 6.8443 2.9643 126.0522 5.6827 29.2233 6.1814 0.7371 11.6589 0.2648 1.4740 24.3215 20.1169 73.8544 104.7451 75.2059 22.0500 10.0250 66.5515 38.7029 72.5484 103.8897 2.4489 115.5232 4.0607 13.6960 3.4204 13.8050 5.9491 12.7722 13.6407 37.1410 85.7939 23.3600 47.2884 6.9525 1.7329 5.6291 11.1400 15.3890 16.1901 0.7796 1.4106 0.0979 0.8445 1.1692 254.5352
temp: 298.150 k
press: 1.00000 atm
elementType: 6 6 6 6 6 6 1 1 1 5 7 6 6 1 1 1 6 1 1 1 6 1 1 1 7
symmnumber: 1
zpe: 542201.4 jmol-1
zpe.correction: 0.206514 hartree
zpe.thermalcorrener: 0.217986 hartree
zpe.thermalcorrenthalpy: 0.218930 hartree
zpe.thermalcorrgfe: 0.169498 hartree
zpe.sumelectzpe: -522.191531 hartree
zpe.sumelectthermal: -522.180059 hartree
zpe.sumelectthermalent: -522.179115 hartree
zpe.sumelectthermalfe: -522.228547 hartree
dipole: -1.1316 2.6357 -3.8517
dipole: 4.8024
quadrupole: -44.5006 -58.5434 -69.2849
quadrupole: -4.5894 2.5577 -10.3538
quadrupole: 12.9424 -1.1004 -11.8419 -4.5894 2.5577 -10.3538
hfenergy: -522.3980451 hartree
pointgroup: C01 [X(C10H12B1N2)]
dipole: -1.0110393 0.6274169 -0.2726808 debye
dipolederiv: 0.6784807 0.3866722 -0.2033838 -0.1685193 -0.0601119 0.1321257 -0.0047348 0.1903502 0.1066323 -0.6155736 0.0114931 0.0206571 0.2807798 -0.5732886 0.2451377 -0.0769901 0.2504998 -0.3150268 0.2662567 0.003947 -0.0507258 -0.1360101 0.1055017 -0.06751 0.109396 -0.1419401 0.033365 -0.2566584 0.0980876 -0.0299295 0.0914098 0.1643395 -0.1204451 -0.050794 -0.121838 -0.012697 -0.0507518 -0.0903873 0.0335781 -0.1156556 0.0402199 -0.0669101 0.0601539 -0.0617436 -0.0823461 -0.5208384 -0.1814517 0.1185585 0.5501609 0.1626183 -0.0677601 -0.2659173 -0.0494831 0.0917353 0.0026287 -0.0194894 0.0160651 -0.0209658 0.1311481 0.006822 0.0211076 0.004223 0.11576 0.0868389 -0.0235417 0.0150586 -0.0141124 0.0324905 0.0636322 0.0090662 0.0641642 0.1229053 0.0359395 0.0540751 -0.0207236 0.0082259 0.0805118 0.0358845 0.0004263 0.032929 0.140067 1.4044864 -0.4258636 0.0182014 -0.5129709 0.8554554 -0.3805687 0.0426718 -0.3824927 0.8333304 -0.2929287 0.5090808 -0.2555678 0.0029088 0.0022101 -0.0156265 -0.0015456 -0.0408758 -0.0133171 0.2108404 0.118274 -0.0676412 -0.1784573 0.334864 -0.1429939 0.0841462 -0.1623584 0.1195234 0.3343909 0.1872343 -0.1115257 0.2621156 -0.340064 0.1759233 -0.1415546 0.1651028 -0.0529598 0.0735052 0.0051932 0.0006706 -0.0207162 0.1171702 0.0185624 0.017434 0.0163159 0.1440666 0.1117421 0.0142575 -0.0044202 0.0392289 0.0917709 0.0209905 -0.0172474 0.0251331 0.1240755 0.3823236 -0.1039638 0.1121867 -0.0667509 0.3537751 -0.0639604 0.1011145 -0.0596081 0.2861372 -0.8066801 0.0716241 0.1635226 -0.0633895 -0.1300095 -0.0099874 0.0450191 0.0439685 -0.1891498 0.0667933 -0.0372034 -0.0596103 -0.0451058 0.0310234 -0.0589732 0.011529 -0.0675889 0.0413568 0.0744593 0.0741185 -0.0130523 0.1144421 -0.0611062 0.0201387 0.0249087 0.018368 0.0797381 0.1092765 -0.0037807 -0.0016222 0.0104921 0.0599014 0.0671965 0.005701 0.0655488 -0.1105108 -0.288049 0.0230258 -0.0358148 0.0885271 -0.4685968 0.3595295 -0.0267491 0.2395591 -0.4176394 -0.0376378 0.0393906 0.1053424 0.0400716 0.0691805 -0.042186 0.1321399 -0.0494411 0.0219723 0.0804616 -0.0834717 0.0048379 -0.0668503 -0.0039425 -0.0804565 -0.0362319 -0.0298007 0.0536157 -0.05196 0.0406485 -0.0788053 0.0189053 0.1253015 -0.0195829 -0.0795151 0.0293362 0.0499939 0.0026542 -0.6679689 0.3241435 -0.0977637 -0.1203628 -0.0089821 0.0364656 0.0216717 -0.170628 unknown
polarizability: 207.7550611|3.9510733|158.7300731|-8.8248147|-40.6842906|109.3269064 unknown
InChI: InChI=1/C10H12BN2/c1-11(2)9-5-3-4-8-6-7-12-13-10(8)9/h3-7,13H,1-2H3
charge 1 multiplicity 1
25 atoms
C  -0.09896579 0.17012784 -0.65057958
C  1.30650174 0.34861536 -0.81586331
C  1.67302315 1.51611817 -1.44987905
C  0.74783147 2.50603403 -1.87827757
C  -0.58911665 2.3260714 -1.70447614
C  -1.05305589 1.13095088 -1.09003147
H  2.72655554 1.70712482 -1.62145519
H  1.12061157 3.40609301 -2.35085583
H  -1.31049094 3.0657858 -2.02902647
B  2.44216875 -0.61157221 -0.25781653
N  -0.60330811 -0.95628797 -0.08925688
C  -2.39933143 0.83396253 -0.89251597
C  -2.75235566 -0.36422824 -0.28806095
H  -3.78199306 -0.64301888 -0.11099679
H  -3.16830671 1.5294384 -1.20792634
H  0.0415135 -1.67252245 0.23254502
C  3.8280039 -0.64687842 -0.98054535
H  4.49734793 0.04111086 -0.44155951
H  4.29992977 -1.62983173 -0.89480913
H  3.82442138 -0.34276017 -2.02916847
C  2.23045129 -1.48231877 1.03558861
H  1.48221919 -1.12401899 1.7488105
H  1.96071495 -2.50859059 0.73683513
H  3.17463357 -1.60228263 1.57391083
N  -1.85224744 -1.25469907 0.10762444
