program: Gaussian 16
title: me_dibenzofuran_prot
version: AS64L-G16RevC.02
method: RwB97XD
basis: GenECP
operation: Freq
keyword: #N
keyword: Geom=AllCheck
keyword: Guess=TCheck
keyword: SCRF=Check
keyword: GenChk
keyword: RwB97XD/GenECP
keyword: Freq
converged: YES YES NO YES
title: Mulliken charges:
elementType: C C O C C C C C H C H H C H C H C C H B N C H H H C H H H C H H H C H H H H
charge: -0.593353 1.239485 0.032730 0.960824 -0.804530 -0.465599 -0.276093 -0.346834 0.213047 -0.299145 0.274392 0.223385 -0.399437 0.220109 -0.542237 0.260837 0.076525 -0.040128 0.220622 0.304471 -0.009005 -0.697582 0.154651 0.168502 0.182865 -0.706297 0.206226 0.176638 0.144201 -0.375536 0.236918 0.230434 0.243127 -0.389231 0.231094 0.240660 0.243523 0.459741
chargesum: 1.00000
title: Mulliken charges with hydrogens summed into heavy atoms:
elementType: C C O C C C C C C C C C C B N C C C C
charge: -0.593353 1.239485 0.032730 0.960824 -0.804530 -0.252552 -0.276093 -0.072442 -0.075760 -0.179328 -0.281400 0.297147 -0.040128 0.304471 0.450736 -0.191565 -0.179231 0.334942 0.326046
1716.lowfreq: -13.3285 -0.0007 -0.0006 -0.0006 14.7309 20.3456 55.4821 67.8804 85.3019
frequency: 54.8228 66.8695 85.2146 99.6435 105.8698 122.8128 136.3280 168.3591 174.7072 205.7463 264.5560 280.4983 287.8963 294.0337 296.2852 304.0564 320.3166 328.9721 374.8585 390.5518 436.6909 466.7604 486.2044 527.5160 563.1118 579.8311 585.1912 596.0314 631.3443 642.6320 680.8969 703.3043 748.6365 764.6230 777.8423 809.0906 823.2255 829.7415 858.9167 865.3787 882.6822 902.2217 927.7406 953.2707 966.9606 972.0251 1012.0195 1020.9451 1021.8844 1077.2838 1085.8325 1090.3012 1102.1546 1145.2827 1170.4709 1179.9149 1189.2070 1200.3926 1218.2053 1230.6157 1262.2267 1273.5949 1283.0907 1312.6260 1333.0221 1342.5549 1346.2452 1358.9997 1391.2560 1438.3050 1442.5735 1446.4779 1448.5833 1455.4484 1461.0524 1476.9397 1479.3820 1481.2178 1490.7672 1506.1954 1514.0168 1521.4614 1528.5839 1542.7770 1550.3476 1658.1478 1669.5118 1676.1812 1723.5270 3015.9008 3020.7393 3088.0812 3094.1104 3095.6330 3097.9524 3130.8968 3134.3439 3199.3591 3199.7979 3201.0310 3208.0735 3208.4702 3210.7485 3215.8025 3222.3564 3223.8008 3234.0199 3459.2902
redmass: 3.0791 3.0073 1.2652 4.0044 3.2032 3.0770 3.3788 3.1322 3.5294 1.1453 1.2732 3.8030 3.1475 1.5852 2.4639 3.5072 1.6227 3.3805 3.9806 2.4110 3.1573 3.0552 4.2846 3.4241 3.6308 3.9209 7.0972 5.1268 4.7475 3.7572 1.4748 4.5430 3.8209 2.4462 3.3091 1.4346 2.6544 2.1422 1.3620 3.8622 5.5031 3.5829 2.1869 1.3797 1.5440 2.8276 1.3969 2.0552 1.3581 2.8754 1.2173 2.3429 1.9548 2.6496 1.9775 1.5333 1.6194 1.9000 1.4308 2.4280 2.8203 2.0004 2.0178 2.1183 1.4077 2.3797 1.5557 5.1575 3.4075 1.2241 2.0438 1.1051 1.3788 1.1794 1.1751 1.0917 1.1034 1.1631 1.0529 1.6935 1.3063 1.0542 1.0945 2.6664 3.0186 6.7839 7.8186 7.0058 8.1951 1.0471 1.0462 1.0857 1.0313 1.0851 1.0306 1.1018 1.1018 1.1080 1.0877 1.1092 1.1073 1.1072 1.0917 1.0912 1.0957 1.0956 1.0977 1.0765
irintensity: 1.0637 2.5669 0.4398 3.0314 5.0960 3.7369 0.7636 2.9584 0.2398 0.7296 0.4906 4.3163 0.4233 0.5909 0.8029 0.6110 0.3965 0.6090 5.2860 0.4285 5.5362 7.4395 9.1904 1.3610 2.5441 2.2647 14.6176 9.4871 7.2031 2.5767 9.6975 1.6470 0.9988 23.3111 17.9521 93.2690 7.6381 1.0504 2.4191 22.1483 21.4647 17.0725 18.0645 0.9012 3.3672 22.0157 0.2887 18.4357 1.5709 28.1365 8.0185 49.6826 71.8473 19.7925 39.8032 26.6350 15.1864 92.5490 24.7153 100.6292 69.3042 17.6631 121.7228 38.3358 121.6000 0.0332 117.1840 5.5027 0.2002 21.4025 128.8282 8.0291 24.9492 20.8943 13.7376 2.3154 22.7006 9.4275 6.4349 7.9767 35.0531 18.5795 21.0913 160.1821 2.7695 33.9986 77.8466 0.1383 13.1849 1.3670 3.5242 16.4694 3.1303 24.2552 1.0743 18.8271 40.7653 3.2385 0.5017 0.4467 0.5621 0.6314 3.9520 1.4719 10.5847 2.5870 1.6187 101.1376
temp: 298.150 k
press: 1.00000 atm
elementType: 6 6 8 6 6 6 6 6 1 6 1 1 6 1 6 1 6 6 1 5 7 6 1 1 1 6 1 1 1 6 1 1 1 6 1 1 1 1
symmnumber: 1
zpe: 847938.8 jmol-1
zpe.correction: 0.322963 hartree
zpe.thermalcorrener: 0.340390 hartree
zpe.thermalcorrenthalpy: 0.341335 hartree
zpe.thermalcorrgfe: 0.278768 hartree
zpe.sumelectzpe: -775.426469 hartree
zpe.sumelectthermal: -775.409041 hartree
zpe.sumelectthermalent: -775.408097 hartree
zpe.sumelectthermalfe: -775.470664 hartree
dipole: 3.6362 24.6564 6.9148
dipole: 25.8645
quadrupole: -101.2968 43.8539 -71.3867
quadrupole: 6.6923 2.5289 45.4988
quadrupole: -58.3536 86.7971 -28.4435 6.6923 2.5289 45.4988
hfenergy: -775.7494318 hartree
pointgroup: C01 [X(C16H19B1N1O1)]
dipole: -1.5219409 3.6359785 1.7234671 debye
polarizability: 165.3736156|-65.9093402|286.6170765|9.2769487|2.8497112|259.7739592 unknown
InChI: InChI=1/C16H19BNO/c1-17(2)13-9-5-7-11-12-8-6-10-14(18(3)4)16(12)19-15(11)13/h5-10,18H,1-4H3
charge 1 multiplicity 1
38 atoms
C  2.02409422 2.11579297 0.16286182
C  1.7633895 2.46885207 -1.16434908
O  1.62507203 3.12878381 1.0200213
C  1.1684528 3.79310679 -1.12353712
C  1.1263255 4.10959874 0.23357293
C  0.68196762 4.71499347 -2.04455559
C  0.62246132 5.30563758 0.69868704
C  0.17297846 5.92297574 -1.578938
H  0.69664185 4.50158455 -3.10615277
C  0.13969172 6.22681088 -0.21654575
H  -0.20712787 6.65096716 -2.28421463
H  -0.2614247 7.17844196 0.1107635
C  2.0929595 1.57746832 -2.18203032
H  1.90881149 1.82520864 -3.22078511
C  2.6608133 0.36397189 -1.82590665
H  2.92809781 -0.35008296 -2.5953738
C  2.88796332 0.04492106 -0.48459748
C  2.58683069 0.91116551 0.57806016
H  3.32982629 -0.91851478 -0.25689202
B  2.91321701 0.53467811 2.07319103
N  0.62458378 5.53809377 2.15065614
C  2.93586291 1.63935337 3.19593084
H  3.3504617 2.59469683 2.86304633
H  1.89198216 1.8401563 3.47983263
H  3.45580491 1.31282912 4.09977375
C  3.24510201 -0.94966623 2.45914863
H  4.34186615 -1.03949963 2.48400354
H  2.91170481 -1.18564452 3.47422873
H  2.87406413 -1.71812828 1.77792059
C  1.4732388 6.7090291 2.54288536
H  1.02461356 7.61339777 2.13761511
H  1.50865951 6.75967116 3.62956826
H  2.46898608 6.56316023 2.1303577
C  -0.75927189 5.6281531 2.71870248
H  -0.68218152 5.68874452 3.80269214
H  -1.24014871 6.52045469 2.323281
H  -1.31067448 4.7401355 2.41858508
H  1.05983824 4.7069377 2.56198223
