program: Gaussian 16
title: me_indenoPy_prot
version: AS64L-G16RevC.02
method: RwB97XD
basis: GenECP
operation: Freq
keyword: #N
keyword: Geom=AllCheck
keyword: Guess=TCheck
keyword: SCRF=Check
keyword: GenChk
keyword: RwB97XD/GenECPFreq
converged: YES YES NO YES
title: Mulliken charges:
elementType: C C C C C C H H H C H H C C C C C H H H N B C H H H C H H H H
charge: 0.273210 -0.163083 0.189051 0.145470 -0.472213 -0.011943 0.263583 0.263768 0.252374 -0.758398 0.251279 0.268163 -1.470579 0.223844 0.462126 0.892209 -0.839243 0.313888 0.306694 0.293943 0.205354 0.009818 -0.817244 0.179566 0.232004 0.180895 -0.687178 0.191232 0.168394 0.192871 0.460143
chargesum: 1.00000
title: Mulliken charges with hydrogens summed into heavy atoms:
elementType: C C C C C C C C C C C C N B C C
charge: 0.273210 -0.163083 0.189051 0.409053 -0.208445 0.240431 -0.238955 -1.470579 0.223844 0.776014 1.198903 -0.545300 0.665497 0.009818 -0.224779 -0.134680
1716.lowfreq: -24.7021 -19.0099 -0.0006 -0.0003 -0.0002 14.0790 44.1924 57.6125 101.1306
frequency: 35.3674 56.8167 101.0473 121.6773 150.6759 160.4848 183.5584 225.5352 252.2316 270.0522 272.7051 343.3552 401.1852 411.7604 418.3524 476.2559 489.1101 535.1859 550.3948 564.5085 572.5763 649.4326 670.2652 686.1338 729.5822 776.0352 783.1020 800.9921 809.4565 824.8233 835.5249 866.3791 874.6991 915.8884 932.6418 940.8232 972.6874 1000.5479 1031.9803 1044.6158 1045.0381 1080.9466 1092.4530 1123.1715 1148.1387 1162.1243 1182.0133 1207.5494 1211.4833 1227.8396 1266.8742 1283.2059 1288.8731 1321.2244 1330.6930 1345.2389 1350.8071 1392.0140 1414.4645 1444.6578 1449.7789 1459.4207 1462.2693 1470.5675 1485.8816 1513.3883 1522.7352 1578.4909 1653.0573 1654.6345 1691.3971 1701.1028 3015.5112 3017.4051 3070.8496 3072.1513 3092.6580 3113.8766 3116.4801 3135.7645 3198.0382 3208.1220 3220.7972 3220.9324 3246.9388 3260.9915 3601.9750
redmass: 2.4603 3.2406 3.6132 2.3307 2.7391 1.0976 1.6660 3.9893 2.2049 4.0757 2.8584 3.6807 2.1361 4.3403 3.0527 3.0239 3.0393 3.9045 3.6746 5.2033 3.5569 6.1630 3.5001 1.4408 4.0509 4.0833 1.3872 2.4385 1.5506 2.1564 1.5046 4.1697 1.3045 2.0578 1.9874 2.3957 1.4181 1.4418 1.3663 6.8460 1.3781 2.5661 2.5200 2.0690 1.7820 2.6619 1.1442 1.4129 1.3820 1.7049 2.1977 3.6926 2.3998 1.9790 1.3209 1.5467 3.3451 1.6298 3.3376 1.2372 1.0478 2.5710 1.0940 1.0629 1.0933 2.4046 2.4754 2.6292 5.8362 6.9444 4.3167 5.6875 1.0437 1.0456 1.0930 1.0615 1.0832 1.1023 1.1011 1.1034 1.0879 1.0919 1.0971 1.0943 1.0925 1.1004 1.0798
irintensity: 0.3501 1.5994 0.8113 2.0625 1.6455 0.6765 2.4665 2.2948 11.0077 0.4992 0.5225 5.7289 0.1400 7.1471 8.3000 3.0588 2.5099 1.5659 2.1383 0.9095 2.1108 4.8110 2.5784 1.3820 8.2298 3.5608 113.5095 68.5477 4.2602 6.8302 0.2638 4.6632 6.8160 39.5057 5.1045 0.6621 0.8753 7.2831 1.3975 1.9504 0.7905 18.3891 71.4230 24.7710 6.2178 67.6625 0.0137 70.4439 11.1474 33.9780 43.3298 72.5602 62.4139 16.0901 127.4833 137.9961 58.5535 98.3438 34.2830 26.5109 3.3759 6.3307 6.0554 2.4679 11.4186 11.8702 11.5698 85.2091 52.6530 14.0064 100.3490 198.8883 2.2339 1.0634 5.7783 0.1355 14.0964 0.0924 25.7264 19.6495 1.4858 4.4844 8.9921 1.8904 2.0509 3.6061 202.7368
temp: 298.150 k
press: 1.00000 atm
elementType: 6 6 6 6 6 6 1 1 1 6 1 1 6 6 6 6 6 1 1 1 7 5 6 1 1 1 6 1 1 1 1
symmnumber: 1
zpe: 681228.3 jmol-1
zpe.correction: 0.259466 hartree
zpe.thermalcorrener: 0.273380 hartree
zpe.thermalcorrenthalpy: 0.274324 hartree
zpe.thermalcorrgfe: 0.218725 hartree
zpe.sumelectzpe: -621.662220 hartree
zpe.sumelectthermal: -621.648307 hartree
zpe.sumelectthermalent: -621.647362 hartree
zpe.sumelectthermalfe: -621.702961 hartree
dipole: 12.7155 -3.8272 1.1781
dipole: 13.3311
quadrupole: -38.0040 -58.4711 -80.8775
quadrupole: -19.0485 15.6053 9.5795
quadrupole: 21.1136 0.6464 -21.7600 -19.0485 15.6053 9.5795
hfenergy: -621.9216864 hartree
pointgroup: C01 [X(C14H15B1N1)]
dipole: 0.659676 -2.0734839 -0.4571212 debye
polarizability: 199.9582766|-38.8376675|262.6236966|46.3223954|34.0471672|159.4066466 unknown
InChI: InChI=1/C14H15BN/c1-15(2)12-7-3-5-10-9-11-6-4-8-16-14(11)13(10)12/h3-8,16H,9H2,1-2H3
charge 1 multiplicity 1
31 atoms
C  0.71211619 0.67128056 -0.45902025
C  1.86488823 0.67167441 0.34357001
C  2.27436343 1.80354542 1.07594994
C  1.46825232 2.93666441 0.92842305
C  0.30832153 2.93707675 0.15136123
C  -0.08169536 1.80411705 -0.5475284
H  1.73839699 3.84931759 1.44814803
H  -0.28877391 3.83937215 0.08862637
H  -0.97794302 1.80738389 -1.15676824
C  0.51201519 -0.65298458 -1.14606374
H  0.48246691 -0.55433385 -2.23482074
H  -0.42082672 -1.13411999 -0.83709078
C  2.47402902 -0.63985193 0.1650733
C  1.70888959 -1.43564423 -0.69628605
C  4.05214175 -2.38149468 0.38087947
C  2.12520841 -2.71242127 -1.00253526
C  3.32086232 -3.19114274 -0.44893421
H  4.98400704 -2.67938419 0.83964064
H  1.54273869 -3.3428565 -1.66424092
H  3.68095803 -4.1863664 -0.66802255
N  3.61777734 -1.13192409 0.66429443
B  3.46360256 1.89172124 2.10888701
C  3.6928492 0.76429495 3.18663142
H  4.73750519 0.43215006 3.24692287
H  3.52274696 1.25284241 4.15620669
H  3.02600915 -0.10098065 3.15569279
C  4.34227534 3.18807512 2.16331056
H  3.84182506 3.88600665 2.85214918
H  5.33589455 3.01716054 2.58534593
H  4.43492736 3.71025873 1.20830617
H  4.17181864 -0.56113583 1.29224904
