program: Gaussian 16
title: me_indole_prot
version: AS64L-G16RevC.02
method: RwB97XD
basis: GenECP
operation: Freq
keyword: #N
keyword: Geom=AllCheck
keyword: Guess=TCheck
keyword: SCRF=Check
keyword: GenChk
keyword: RwB97XD/GenECPFreq
converged: YES YES YES YES
title: Mulliken charges:
elementType: C C C C C C C C H H H N H B C H H H C H H H C H H H C H H H H
charge: -0.359361 0.913233 -1.404097 -0.768628 0.412606 -0.509666 -0.173992 0.759959 0.219149 0.249008 0.241921 0.209788 0.303762 0.260005 -0.411526 0.273208 0.220298 0.203719 -0.672695 0.141545 0.227689 0.203647 -0.614173 0.203717 0.153255 0.167923 -0.494268 0.182001 0.226184 0.179677 0.456113
chargesum: 1.00000
title: Mulliken charges with hydrogens summed into heavy atoms:
elementType: C C C C C C C C N B C C C C
charge: -0.359361 1.216995 -1.404097 -0.549479 0.412606 -0.260659 0.067929 0.759959 0.665902 0.260005 0.285699 -0.099814 -0.089278 0.093593
1716.lowfreq: -22.7483 -0.0005 -0.0004 0.0002 17.7020 19.0049 66.0512 83.9645 97.2044
frequency: 65.9336 82.6982 95.7109 114.6520 136.5187 155.3623 184.8345 191.8997 241.2454 268.4476 276.3732 299.7597 338.1096 358.6201 387.1304 409.4749 437.4629 459.1213 514.7592 548.6397 589.9950 612.4749 647.2136 710.0259 747.5040 769.5982 791.4652 835.0919 845.9822 855.5366 858.7601 910.9196 924.8214 947.5435 965.1524 997.2411 1011.3551 1028.0163 1046.7283 1069.2488 1138.0541 1153.4491 1164.1355 1176.7704 1194.2524 1205.6896 1237.5278 1267.6564 1301.7918 1310.6010 1345.6817 1349.6127 1357.8058 1381.1334 1403.3506 1422.2654 1445.4861 1462.0106 1467.0912 1471.9481 1476.8366 1492.5618 1492.9135 1501.2515 1505.3669 1516.5675 1555.8687 1636.4297 1679.9682 1699.1805 3023.7387 3027.2069 3055.9138 3092.5345 3095.5047 3101.3632 3122.2541 3126.9165 3143.0011 3151.1858 3199.2360 3203.0038 3208.5383 3211.3341 3226.2099 3256.6570 3491.3217
redmass: 2.9648 2.3384 1.1271 2.9283 1.4126 2.1660 1.6360 1.5984 2.9160 3.0548 2.8072 1.1369 3.1287 3.2478 3.0717 2.4377 2.9297 2.8105 3.6538 3.7989 4.0294 3.1748 4.4982 1.2298 4.7553 4.3365 3.7461 2.6214 1.3651 1.3449 2.6737 1.3300 1.9124 3.7233 1.5246 2.2091 1.3517 1.5630 3.0158 1.5857 2.5669 1.7084 1.7917 1.3778 1.7740 1.5726 2.2763 2.3296 1.7270 3.4353 1.4229 1.2836 1.5112 3.1993 1.2896 1.2484 1.0498 1.3073 1.3169 1.0918 1.1630 1.0752 1.0637 1.1118 1.3672 1.0674 2.9801 7.5820 6.7746 7.1753 1.0467 1.0467 1.0384 1.0883 1.0313 1.0838 1.1005 1.0986 1.1015 1.1039 1.1085 1.0905 1.0963 1.1064 1.0959 1.0975 1.0744
irintensity: 0.0699 1.2418 0.5436 1.3594 0.0737 0.9743 3.8785 0.7158 0.1838 1.4135 0.0462 0.5936 1.5307 0.1780 0.3355 2.5653 7.6286 10.0986 3.1315 6.0702 2.4282 19.2957 4.5640 1.4581 3.4692 4.6829 8.9733 16.1348 2.1905 26.9505 3.1167 13.9050 57.7177 7.8201 3.8509 10.3287 1.9570 4.1867 11.4480 22.1884 36.9682 3.5992 37.2265 29.1086 146.3171 166.4677 144.3020 28.0551 40.1577 4.7250 25.8548 54.1432 120.5759 20.3258 21.8632 2.7711 1.7312 9.2340 4.4551 13.8961 7.1310 19.8344 1.5959 19.1751 3.5906 22.3963 6.1662 222.0471 175.3397 37.5501 1.0771 2.7712 10.6579 16.2995 3.6280 9.4252 28.4094 9.9232 20.3932 9.9387 0.9017 4.0801 1.1825 0.2572 2.2004 1.2255 91.6965
temp: 298.150 k
press: 1.00000 atm
elementType: 6 6 6 6 6 6 6 6 1 1 1 7 1 5 6 1 1 1 6 1 1 1 6 1 1 1 6 1 1 1 1
symmnumber: 1
zpe: 707475.1 jmol-1
zpe.correction: 0.269463 hartree
zpe.thermalcorrener: 0.283606 hartree
zpe.thermalcorrenthalpy: 0.284550 hartree
zpe.thermalcorrgfe: 0.229437 hartree
zpe.sumelectzpe: -546.629692 hartree
zpe.sumelectthermal: -546.615549 hartree
zpe.sumelectthermalent: -546.614605 hartree
zpe.sumelectthermalfe: -546.669718 hartree
dipole: -6.7404 1.2059 1.3268
dipole: 6.9748
quadrupole: -55.4253 -55.3642 -76.2752
quadrupole: -9.1520 6.9640 -0.5630
quadrupole: 6.9296 6.9907 -13.9203 -9.1520 6.9640 -0.5630
hfenergy: -546.8991552 hartree
pointgroup: C01 [X(C12H17B1N1)]
dipole: 0.8028262 0.277044 0.5766276 debye
polarizability: 182.8224009|-40.3615268|239.0399467|32.8314119|-4.9206753|124.4496352 unknown
InChI: InChI=1/C12H17BN/c1-9-5-6-10-8-12(13(2)3)14(4)11(10)7-9/h5-8,14H,1-4H3
charge 1 multiplicity 1
31 atoms
C  -1.31605177 -1.4042255 -0.02026549
C  -2.52885959 -1.24637671 -0.58109882
C  -1.89300476 0.88955591 -0.04352672
C  -1.91630313 2.25710195 0.10267338
C  -3.0453525 2.93197707 -0.37652616
C  -4.08787233 2.19797328 -0.96055293
C  -4.04254679 0.81719106 -1.09000297
C  -2.91681477 0.15167101 -0.61836341
H  -1.1023103 2.80594323 0.56215764
H  -4.95996276 2.73195071 -1.32114068
H  -4.8627334 0.2736857 -1.54223501
N  -0.83912859 -0.0365064 0.39401475
H  -3.12185609 -2.0621 -0.96999656
B  -0.41792277 -2.67238159 0.09852098
C  -0.56521817 0.05543752 1.86622542
H  -1.49595691 -0.15941227 2.3870353
H  0.19808073 -0.67368762 2.12531014
H  -0.2198703 1.06121381 2.09527444
C  1.1082014 -2.56531907 0.45624968
H  1.57438822 -1.57893579 0.37694647
H  1.24308593 -2.90332573 1.49364537
H  1.69489333 -3.26098517 -0.15037061
C  -1.0843337 -4.07373895 -0.10407784
H  -1.2433017 -4.4967437 0.89880375
H  -2.05650877 -4.07451359 -0.60093402
H  -0.42233081 -4.7738645 -0.62015588
C  -3.12701174 4.430645 -0.29068618
H  -2.49945221 4.8210451 0.51171852
H  -2.78942837 4.88002441 -1.22933253
H  -4.15322326 4.75890543 -0.11857673
H  0.0281559 0.1670124 -0.10886029
