program: Gaussian 16
title: me_mequinolinamine_prot
version: AS64L-G16RevC.02
method: RwB97XD
basis: GenECP
operation: Freq
keyword: #N
keyword: Geom=AllCheck
keyword: Guess=TCheck
keyword: SCRF=Check
keyword: GenChk
keyword: RwB97XD/GenECPFreq
converged: YES YES NO YES
title: Mulliken charges:
elementType: C C C C C H C H C C H H H N B C H H H C H H H C N H C H H H H
charge: -0.175819 0.675565 -0.254842 0.610352 -0.750434 0.284873 0.006686 0.241215 -0.462987 -0.074955 0.265986 0.302518 0.296073 0.179162 0.364672 -0.834285 0.207497 0.175795 0.176986 -0.746160 0.199711 0.199027 0.151594 -0.706894 -0.238404 0.359541 -0.461863 0.189303 0.217451 0.194365 0.408270
chargesum: 1.00000
title: Mulliken charges with hydrogens summed into heavy atoms:
elementType: C C C C C C C C N B C C C N C
charge: 0.109054 0.675565 -0.254842 0.610352 -0.509219 0.272672 -0.160469 0.221118 0.587433 0.364672 -0.274008 -0.195828 -0.706894 0.121136 0.139256
1716.lowfreq: 0.0007 0.0008 0.0008 12.5916 22.3163 25.8768 73.5035 80.3780 106.3716
frequency: 73.2541 79.6953 106.1872 114.6256 125.0302 157.6209 174.8367 185.8484 198.5850 216.5481 286.8198 298.7761 311.7060 359.9792 368.9132 384.1760 428.7424 439.3337 461.4547 531.6004 548.1377 582.7491 610.8569 644.0804 649.5173 692.7619 758.8647 772.6639 791.8797 812.7551 845.3310 857.6478 876.5224 895.6059 915.3654 941.0006 945.6472 995.3692 1007.2206 1022.9775 1090.9370 1102.7585 1147.4180 1152.7676 1156.9304 1175.8564 1191.5139 1236.4238 1266.9221 1304.0828 1327.1696 1339.2090 1346.3071 1365.2095 1397.2519 1429.2361 1450.5321 1453.3974 1458.5688 1468.0117 1479.2103 1491.4814 1491.8979 1495.1698 1518.0623 1522.3480 1568.6493 1620.0383 1647.2242 1672.8998 1696.7343 3006.7805 3021.1692 3033.3565 3085.4058 3092.0173 3094.5533 3122.6043 3136.6574 3161.9626 3200.0344 3205.8434 3225.3121 3239.5324 3263.2729 3609.1350 3688.9863
redmass: 2.8235 2.9633 3.4114 2.2283 1.7173 1.5110 1.6513 1.2892 2.8487 2.2408 2.6658 3.6559 3.0898 2.1954 1.8074 1.8082 3.0967 3.5348 3.3314 3.6249 5.2084 3.9020 4.6932 2.7760 4.0161 1.3162 4.2729 3.9592 1.4346 2.8260 1.3473 1.3124 1.5661 2.8593 2.0627 2.7641 1.7802 1.3503 3.6277 1.3296 2.2803 1.9884 2.4613 1.2797 2.6557 1.4889 1.8672 1.9266 1.5456 1.5408 2.0708 1.5102 1.4998 1.6880 2.3087 5.1065 1.0783 1.9796 1.0800 1.9670 1.1310 1.1134 1.0488 1.4940 1.2714 1.9105 2.2307 2.4618 5.5172 4.7783 4.8253 1.0496 1.0464 1.0374 1.0827 1.0861 1.1056 1.1017 1.1015 1.0997 1.0925 1.0922 1.0895 1.0951 1.0977 1.0790 1.0779
irintensity: 1.5480 8.8612 2.6680 0.2275 0.2599 0.2817 0.0496 1.2041 5.2098 4.1370 1.1199 0.1368 9.3555 18.2759 34.8250 35.0468 19.6580 8.1642 7.5500 4.8979 10.9762 3.5465 1.8664 2.9853 8.0174 10.6326 16.3535 22.7081 54.0095 4.6072 1.3289 27.4368 40.3644 3.8993 29.7742 12.3237 12.3715 4.5642 4.0916 0.1272 6.9709 4.7325 95.8282 1.6729 57.1192 95.8557 37.3073 21.9306 14.3406 52.3454 181.5541 126.9248 108.5977 78.6178 3.5913 2.4990 16.5929 221.4238 7.9783 63.9654 7.6630 31.0681 1.9681 50.9871 109.9386 0.9547 156.5709 23.1478 108.0969 651.8525 27.1392 5.9505 0.6225 77.2444 7.5496 14.1117 27.9573 17.7578 19.2050 13.2886 4.0222 2.5332 1.4086 0.3159 9.1318 240.5133 109.7178
temp: 298.150 k
press: 1.00000 atm
elementType: 6 6 6 6 6 1 6 1 6 6 1 1 1 7 5 6 1 1 1 6 1 1 1 6 7 1 6 1 1 1 1
symmnumber: 1
zpe: 692168.5 jmol-1
zpe.correction: 0.263633 hartree
zpe.thermalcorrener: 0.278382 hartree
zpe.thermalcorrenthalpy: 0.279326 hartree
zpe.thermalcorrgfe: 0.222856 hartree
zpe.sumelectzpe: -600.807840 hartree
zpe.sumelectthermal: -600.793091 hartree
zpe.sumelectthermalent: -600.792147 hartree
zpe.sumelectthermalfe: -600.848617 hartree
dipole: -11.7354 6.5227 0.4654
dipole: 13.4344
quadrupole: -11.6851 -51.3971 -91.2960
quadrupole: -11.6486 2.7655 0.0751
quadrupole: 39.7743 0.0623 -39.8366 -11.6486 2.7655 0.0751
hfenergy: -601.0714733 hartree
pointgroup: C01 [X(C12H16B1N2)]
dipole: 0.9429359 1.1012475 0.0502058 debye
polarizability: 267.6098943|34.1278417|230.8235952|16.9091659|2.6906012|107.2314604 unknown
InChI: InChI=1/C12H16BN2/c1-13(2)11-8-10(14-3)7-9-5-4-6-15-12(9)11/h4-8,14-15H,1-3H3
charge 1 multiplicity 1
31 atoms
C  -4.11844399 -0.04228336 -0.08063318
C  -2.74688038 -0.06263091 0.0499185
C  -2.10075717 1.20225791 0.11581311
C  -2.83864404 2.4126019 0.05635787
C  -4.23750135 2.36761689 -0.04496532
H  -4.63932158 -0.98927895 -0.15090321
C  -2.12339159 3.63366735 0.10152096
H  -4.79016773 3.29977974 -0.07789311
C  -0.75356685 3.65410168 0.19674335
C  -0.0663927 2.44568613 0.24728324
H  -2.67589416 4.56587893 0.05763574
H  -0.19956547 4.58144988 0.23145861
H  1.00972585 2.37419087 0.32248494
N  -0.73829583 1.30246462 0.20280357
B  -2.04306642 -1.47429827 0.2111807
C  -0.73260061 -1.66068562 1.06853816
H  -0.71681518 -2.65048373 1.53309906
H  0.14398608 -1.66379687 0.40024759
H  -0.56121277 -0.91964966 1.85507176
C  -2.69426412 -2.74215206 -0.43747768
H  -1.9392358 -3.48008732 -0.72388455
H  -3.29769413 -3.23460279 0.34036598
H  -3.35061889 -2.5541377 -1.28942529
C  -4.90290077 1.15204835 -0.10990716
N  -6.25441875 1.08283035 -0.20431392
H  -6.76261674 1.94938565 -0.2422671
C  -7.01359178 -0.14509439 -0.32308844
H  -6.87925073 -0.78942777 0.55123996
H  -8.06914413 0.1112641 -0.39142663
H  -6.7423216 -0.70547311 -1.2235556
H  -0.21072967 0.43856416 0.2456421
