program: Gaussian 16
title: MeQHBMe2-H+
version: ES64L-G16RevC.01
method: RwB97XD
basis: GenECP
operation: Freq
keyword: #N
keyword: Geom=AllCheck
keyword: Guess=TCheck
keyword: SCRF=Check
keyword: GenChk
keyword: RwB97XD/GenECPFreq
converged: YES YES NO YES
title: Mulliken charges:
elementType: C H C N N N B H C H H H C H H H C H H H
charge: -0.378280 0.322595 -0.144394 0.234211 0.092170 -0.120972 0.429582 0.451458 -0.384969 0.233139 0.245409 0.222333 -0.684410 0.189251 0.213921 0.142440 -0.618964 0.219152 0.146452 0.189876
chargesum: 1.00000
title: Mulliken charges with hydrogens summed into heavy atoms:
elementType: C C N N N B C C C
charge: -0.055684 -0.144394 0.234211 0.092170 0.330486 0.429582 0.315912 -0.138798 -0.063485
1716.lowfreq: -33.3729 0.0007 0.0008 0.0009 20.2972 44.9866 76.8414 109.1024 140.4510
frequency: 57.3017 107.5324 137.9357 145.1472 157.4187 197.9606 284.7780 303.1499 347.5842 415.8537 449.3603 499.7958 668.5580 689.1954 714.4361 721.6401 807.4085 838.6025 855.6367 868.2913 916.5565 1028.2491 1089.1188 1105.1814 1124.0417 1164.5538 1182.9987 1223.1925 1275.1114 1341.7857 1361.9211 1372.0310 1409.2131 1438.5894 1451.0716 1453.5059 1473.5903 1480.5851 1486.4631 1493.9093 1515.3240 1527.0258 1641.9363 3018.5187 3019.9571 3092.6782 3094.3963 3099.7633 3137.8378 3140.0879 3197.5553 3216.0852 3298.3822 3630.7192
redmass: 1.0898 2.8156 1.3083 2.0929 2.2288 1.2924 3.4826 2.5332 3.1329 2.2199 3.0953 3.0809 2.6094 1.4733 7.3467 3.4689 1.1354 1.8482 1.4831 1.3616 2.2041 3.4192 3.7138 1.7838 2.1468 1.3491 2.5679 2.0067 2.1296 1.3623 1.6689 3.5624 3.7870 1.1427 2.0898 1.0970 1.4165 1.1231 1.2494 1.0942 1.2497 1.7223 3.2579 1.0482 1.0484 1.0848 1.0847 1.0317 1.1021 1.1004 1.1076 1.1081 1.1040 1.0846
irintensity: 0.6859 0.2015 0.0210 0.0262 0.5163 0.8093 4.7627 2.3498 1.2494 2.4256 2.8039 4.3573 10.8046 0.9206 4.9793 16.9066 83.5512 15.4752 40.0599 0.6852 28.2005 51.6631 9.8607 34.8045 4.5605 0.9608 47.0322 240.0796 79.4515 45.3970 127.3542 56.4790 13.2634 2.8682 1.8462 2.7323 21.8217 4.9165 26.7308 11.1105 19.6677 11.7128 17.9013 1.6252 4.6479 0.1169 17.7849 2.2873 19.8905 13.4591 0.0955 0.5912 19.7681 208.9778
temp: 298.150 k
press: 1.00000 atm
elementType: 6 1 6 7 7 7 5 1 6 1 1 1 6 1 1 1 6 1 1 1
symmnumber: 1
zpe: 447221.1 jmol-1
zpe.correction: 0.170338 hartree
zpe.thermalcorrener: 0.180253 hartree
zpe.thermalcorrenthalpy: 0.181197 hartree
zpe.thermalcorrgfe: 0.135212 hartree
zpe.sumelectzpe: -385.869348 hartree
zpe.sumelectthermal: -385.859432 hartree
zpe.sumelectthermalent: -385.858488 hartree
zpe.sumelectthermalfe: -385.904473 hartree
dipole: 12.8983 5.6623 2.4426
dipole: 14.2966
quadrupole: -10.5919 -26.6857 -43.2851
quadrupole: 4.2335 7.8882 2.9860
quadrupole: 16.2623 0.1685 -16.4309 4.2335 7.8882 2.9860
hfenergy: -386.0396852 hartree
pointgroup: C01 [X(C5H11B1N3)]
dipole: -0.5758026 0.879727 -0.3066137 debye
dipolederiv: 0.0205448 -0.0293517 -0.0919946 -0.0095071 0.0671613 0.1622254 0.0382289 -0.0527671 0.0442718 0.176628 0.0157179 -0.0004552 0.0155647 0.1570392 -0.0056437 -0.0067896 0.0024558 0.1631861 -0.1765574 0.2566083 -0.0634524 0.2089263 -0.3685378 0.0463843 -0.2444262 0.3364401 -0.337836 -0.0765059 0.0872446 0.0510121 0.1222298 -0.2432441 -0.0375366 0.08822 -0.0961309 0.1462609 -0.0636304 -0.0325966 -0.2296274 -0.0423332 0.0827043 0.2765923 -0.2361393 0.2940243 -0.460272 -0.1251244 0.1307754 0.1845717 0.1522984 -0.368541 -0.223321 0.206287 -0.2704475 0.259113 0.7414985 -0.467185 0.2556768 -0.443858 1.2899564 -0.103586 0.3050603 -0.1573635 1.2503547 0.3201297 -0.0222437 -0.026673 -0.0219163 0.3696883 0.0619054 -0.0418418 0.0778958 0.3641664 0.2832995 -0.1780035 0.0251993 -0.2192454 0.4931265 -0.0505426 0.0187646 -0.0401364 0.0993829 0.1097664 0.0331754 0.0319371 0.0379895 0.0765965 -0.0412991 -0.0047133 0.0205752 0.0315475 0.0263236 0.0314184 0.0299743 -0.0129707 0.0068537 0.0489943 0.0490209 0.0311112 0.0992918 0.0325418 -0.0208281 -0.066784 0.0340991 0.0345462 -0.0047376 -0.0539848 -0.0399729 0.0860591 -0.1960405 0.0462096 -0.0197154 0.1723504 -0.642508 -0.1857866 0.0337887 -0.2209433 -0.2892732 0.0053173 0.0961208 -0.0518694 0.0702128 0.0482558 0.0646196 -0.0589974 0.050593 0.0405569 -0.0184849 -0.0260627 -0.0030378 -0.0845535 0.075423 -0.0126851 -0.0173707 -0.0101363 0.1061105 0.0727345 0.0168765 0.0712747 -0.0200624 0.0980983 0.0512521 0.0528491 0.0569092 -0.1151149 -0.2529397 -0.0012592 -0.2855124 -0.0192382 -0.2076351 -0.0135889 -0.16989 0.0185751 -0.6937515 -0.0236347 -0.0328585 0.0465098 -0.0370667 0.101341 -0.0220647 -0.0164972 -0.0040355 0.0961289 0.0266833 0.100041 0.0839306 0.1027988 -0.0380551 -0.0690993 0.0546909 -0.0771262 0.0502817 0.1174507 -0.0037988 0.0590351 -0.0057184 -0.0322696 0.0579178 0.0037401 0.0804799 0.0595354 unknown
polarizability: 81.5772583|-24.1990266|105.9292061|9.26738|-4.2613792|102.5353809 unknown
InChI: InChI=1/C5H11BN3/c1-6(2)5-4-9(3)8-7-5/h4,7H,1-3H3
charge 1 multiplicity 1
20 atoms
C  2.54894164 1.60233777 1.14648496
H  2.4184062 2.06024614 2.11284989
C  3.18827316 0.44172867 0.77487171
N  2.04900593 2.14944908 0.01415616
N  2.31925108 1.42805586 -1.0402594
N  2.99508574 0.42044893 -0.57562624
B  3.95097005 -0.65992116 1.61770634
H  3.31652484 -0.27801621 -1.23580249
C  1.26176878 3.3754996 -0.12424918
H  1.18118387 3.59835845 -1.18462433
H  0.27490102 3.21113281 0.30464758
H  1.7768408 4.18100221 0.39441124
C  4.4903844 -1.92597002 0.88169441
H  5.22795195 -2.47209718 1.47221722
H  3.63949634 -2.60868558 0.73516488
H  4.91181428 -1.74300403 -0.11157484
C  4.11703107 -0.4367858 3.14837921
H  5.16554696 -0.14451296 3.31065586
H  3.49118941 0.3333573 3.60280517
H  3.99344014 -1.37228241 3.70204725
