program: Gaussian 16
title: me_naphthalene_prot
version: AS64L-G16RevC.02
method: RwB97XD
basis: GenECP
operation: Freq
keyword: #N
keyword: Geom=AllCheck
keyword: Guess=TCheck
keyword: SCRF=Check
keyword: GenChk
keyword: RwB97XD/GenECPFreq
converged: YES YES NO YES
title: Mulliken charges:
elementType: C C C C C C H C C H H C C H H H B C H H H C H H H N C H H H C H H H H
charge: -0.289171 -0.076487 -0.034269 0.391076 -0.351892 -0.421845 0.189070 0.269790 -0.152489 0.216437 0.271279 -0.454547 0.031727 0.235979 0.267066 0.234790 -0.216898 -0.614193 0.194052 0.166704 0.183344 -0.792838 0.269748 0.208069 0.195790 -0.023476 -0.503972 0.251795 0.245010 0.253970 -0.346954 0.253915 0.222295 0.256937 0.470190
chargesum: 1.00000
title: Mulliken charges with hydrogens summed into heavy atoms:
elementType: C C C C C C C C C C B C C N C C
charge: -0.100101 -0.076487 -0.034269 0.391076 -0.135455 -0.150566 0.269790 0.083491 -0.187481 0.266517 -0.216898 -0.070093 -0.119231 0.446715 0.246803 0.386192
1716.lowfreq: -9.9009 -0.0011 -0.0010 0.0015 10.8667 22.7330 58.9827 102.6667 114.2390
frequency: 58.3961 102.5099 113.9626 123.6147 153.5257 171.9022 182.8162 194.9161 211.9950 241.2466 259.0720 268.3570 302.1448 313.3951 330.2621 372.1337 401.8308 447.3043 455.6324 480.9455 497.6538 519.8336 538.9004 551.0359 608.9568 647.1368 661.4830 695.4262 760.2915 787.3320 793.8554 801.7607 823.8601 844.7934 853.1030 899.6871 917.4503 945.1878 968.5269 969.6646 1021.0310 1025.3767 1030.0780 1043.4501 1071.4896 1081.9218 1113.1464 1151.4035 1157.8161 1183.8785 1191.4054 1205.1330 1216.3380 1236.5087 1257.7247 1283.4659 1291.2273 1334.7575 1342.5321 1370.7167 1384.0247 1409.3751 1420.5794 1442.1447 1461.0276 1461.8737 1465.9636 1476.9332 1479.4440 1491.3227 1494.6882 1502.0319 1504.6818 1507.3917 1527.7811 1531.4278 1566.9116 1640.7074 1665.4526 1707.6845 3008.9657 3013.2554 3076.2851 3087.8152 3089.1007 3101.9318 3118.2119 3137.9858 3190.8207 3192.2510 3197.3918 3199.8392 3203.6329 3204.1803 3209.8037 3220.7666 3223.2757 3235.3986 3441.4754
redmass: 3.6287 2.8148 2.8002 2.3205 1.4225 3.7710 3.0325 1.7953 2.4710 1.2042 1.8280 2.0737 1.4870 2.0449 1.9766 3.3234 2.5365 2.8643 2.5420 3.2572 4.2275 3.5964 4.1878 5.6366 3.8560 3.5563 3.3251 1.3063 3.5544 1.5111 1.8563 4.3115 1.7674 2.1581 2.0227 2.6259 2.3797 1.4167 1.4186 2.5953 1.5649 2.3776 1.3512 2.6330 1.6947 1.5763 2.0015 2.5543 2.1418 1.5207 1.5076 1.5989 1.3109 1.9608 1.7103 1.8712 2.0144 1.2492 1.5118 3.0492 1.7967 4.2466 1.5697 1.0694 1.1402 1.3770 1.1447 1.1252 1.1337 1.2068 1.1759 1.2647 1.1279 1.8896 1.0567 1.1548 3.4750 6.4167 5.4048 6.1962 1.0498 1.0461 1.0864 1.0535 1.0568 1.0315 1.1023 1.1035 1.0885 1.1087 1.0913 1.1080 1.0928 1.1048 1.1080 1.0980 1.0928 1.0969 1.0760
irintensity: 1.3430 0.0638 1.4711 2.1140 0.6221 4.1177 10.4220 2.6404 0.6070 1.6130 0.7623 0.4955 0.7975 0.5150 1.4709 11.3334 1.3416 9.2393 0.4811 0.8649 2.8944 5.7698 2.7354 3.5335 1.2296 2.9420 3.0845 5.2195 5.5006 8.0919 48.1765 0.7881 4.5874 5.3806 62.6461 31.4656 7.4755 2.1564 1.6187 16.6092 2.0398 8.7695 1.3938 19.1696 4.6370 13.5245 3.1566 51.6284 85.6736 8.6501 30.1052 20.7850 49.5284 3.0867 11.0438 47.4519 43.5636 90.2894 106.6912 35.4331 12.7334 6.5974 6.3503 3.1081 10.2362 3.0873 3.0922 5.2701 6.1943 2.3394 22.1844 2.2407 41.0313 9.3554 25.6931 28.8475 36.4647 12.4923 7.8360 0.6925 2.5156 4.1223 11.2733 9.2923 12.0809 0.6987 17.2946 14.6698 3.4554 2.7423 1.6146 1.5204 1.4575 2.0913 0.3841 8.9840 6.2034 1.6022 348.0022
temp: 298.150 k
press: 1.00000 atm
elementType: 6 6 6 6 6 6 1 6 6 1 1 6 6 1 1 1 5 6 1 1 1 6 1 1 1 7 6 1 1 1 6 1 1 1 1
symmnumber: 1
zpe: 802545.5 jmol-1
zpe.correction: 0.305673 hartree
zpe.thermalcorrener: 0.321061 hartree
zpe.thermalcorrenthalpy: 0.322005 hartree
zpe.thermalcorrgfe: 0.264819 hartree
zpe.sumelectzpe: -624.010405 hartree
zpe.sumelectthermal: -623.995017 hartree
zpe.sumelectthermalent: -623.994073 hartree
zpe.sumelectthermalfe: -624.051259 hartree
dipole: -16.0568 -6.6864 2.2671
dipole: 17.5405
quadrupole: -20.0807 -55.8907 -88.7882
quadrupole: 23.7021 -14.4668 -7.4008
quadrupole: 34.8391 -0.9708 -33.8683 23.7021 -14.4668 -7.4008
hfenergy: -624.3160781 hartree
pointgroup: C01 [X(C14H19B1N1)]
dipole: -0.7467489 -2.2194443 0.7202294 debye
polarizability: 244.0347519|-1.8339934|236.975081|-28.8043684|-7.6290303|139.6625743 unknown
InChI: InChI=1/C14H19BN/c1-15(2)12-9-5-7-11-8-6-10-13(14(11)12)16(3)4/h5-10,16H,1-4H3
charge 1 multiplicity 1
35 atoms
C  -5.35963612 -0.39807573 0.7872148
C  -4.05280517 -0.62690396 0.45761771
C  -3.15872019 0.40834008 0.05504023
C  -3.70260685 1.72564084 0.06369429
C  -5.0630731 1.9433232 0.38995456
C  -5.88191281 0.90573355 0.73309229
H  -6.0048048 -1.20665924 1.10408019
C  -1.77077261 0.22047437 -0.28421645
C  -2.86859946 2.8331027 -0.24239676
H  -5.44436564 2.95805941 0.37308814
H  -6.92114523 1.07503167 0.98382077
C  -1.54308897 2.65450449 -0.50109958
C  -1.00453358 1.35086494 -0.50278344
H  -3.30535141 3.82554132 -0.24624503
H  -0.90122402 3.50141933 -0.71093344
H  0.04952021 1.23854966 -0.73333154
B  -1.02082056 -1.08887869 -0.72617767
C  0.40237404 -1.43447289 -0.17588739
H  0.23737875 -2.13799813 0.65667355
H  1.03151057 -1.96839885 -0.89292072
H  0.9564133 -0.59393356 0.24676823
C  -1.67193833 -2.06144221 -1.7918318
H  -1.10295315 -1.82615204 -2.7039879
H  -1.48040662 -3.12637721 -1.61895944
H  -2.72183428 -1.90244766 -2.0578585
N  -3.5188837 -1.99756261 0.63543596
C  -2.93602885 -2.17996594 2.00311233
H  -3.74672123 -2.11547235 2.72637326
H  -2.45481389 -3.15608564 2.05021177
H  -2.2125345 -1.38650156 2.1799203
C  -4.46346741 -3.10300189 0.28971746
H  -3.88906391 -4.02697854 0.25052741
H  -5.22870156 -3.18630458 1.05755309
H  -4.91174111 -2.89340299 -0.67907151
H  -2.75785182 -2.0955243 -0.04045518
