program: Gaussian 16
title: me_phquinolinamine_prot
version: AS64L-G16RevC.02
method: RwB97XD
basis: GenECP
operation: Freq
keyword: #N
keyword: Geom=AllCheck
keyword: Guess=TCheck
keyword: SCRF=Check
keyword: GenChk
keyword: RwB97XD/GenECPFreq
converged: YES YES YES YES
title: Mulliken charges:
elementType: C C C C C H C H C C H H H N B C H H H C H H H C N H C C C C H C H C H H H H
charge: 0.115929 0.024423 -0.648164 0.291412 -0.566138 0.248984 0.963931 0.243858 -0.965099 0.123332 0.293753 0.295419 0.302750 0.168525 0.390867 -0.867244 0.201018 0.188589 0.163858 -0.697079 0.195336 0.203674 0.148505 -0.701220 -0.017560 0.332675 -0.116667 -0.192417 0.153929 -0.292495 0.230276 -0.111937 0.246619 -0.475331 0.246711 0.249290 0.226394 0.401296
chargesum: 1.00000
title: Mulliken charges with hydrogens summed into heavy atoms:
elementType: C C C C C C C C N B C C C N C C C C C C
charge: 0.364913 0.024423 -0.648164 0.291412 -0.322280 1.257684 -0.669680 0.426082 0.569820 0.390867 -0.313779 -0.149565 -0.701220 0.315115 -0.116667 0.037859 0.400548 -0.045785 0.137353 -0.248937
1716.lowfreq: -17.5354 -7.3726 -0.0005 -0.0005 -0.0004 17.3475 29.8843 48.2094 67.6723
frequency: 26.5801 47.2967 67.5615 76.8354 87.2127 110.4060 120.6673 170.4487 175.9855 191.6032 210.8726 247.1842 276.4994 302.7450 323.3776 346.4116 359.2705 378.1730 425.8237 428.0876 446.4610 455.7800 501.7432 528.9908 546.7635 567.6476 576.7727 634.9163 636.5329 650.7035 666.4705 692.9313 722.4120 764.4766 771.0243 779.5134 803.0678 811.1612 843.4670 847.8328 853.4790 870.1491 873.7870 899.9822 917.4607 947.9482 968.9097 971.9958 1003.9136 1010.2101 1017.5028 1024.5986 1024.7805 1028.4962 1061.2508 1096.0414 1117.2609 1151.9585 1155.0776 1182.6967 1186.7903 1208.6284 1215.8313 1262.2602 1268.7591 1287.2910 1315.8373 1329.8042 1336.8356 1345.2113 1356.9929 1367.2612 1395.4579 1425.7252 1446.3977 1455.0405 1462.5910 1467.0725 1487.2365 1491.3091 1500.0857 1515.5782 1539.2825 1569.2932 1620.4160 1648.8016 1661.4263 1669.0968 1680.2965 1697.5731 2994.8035 3017.8715 3080.7871 3091.8524 3118.9985 3137.6354 3190.8085 3195.3458 3196.4930 3204.6455 3206.9479 3211.4633 3221.9319 3224.3221 3245.7881 3263.5323 3591.9898 3668.4309
redmass: 5.0918 3.7468 3.0407 3.3015 3.0498 4.4529 1.6631 1.7198 1.4030 3.8730 3.1254 4.9450 3.5594 2.6608 3.0746 2.8541 1.4942 2.2823 2.8122 2.9502 3.1838 4.1656 3.4463 3.4673 6.4234 4.9867 4.2391 6.1199 2.8260 5.6279 3.2338 1.4508 2.0108 2.8962 2.8617 1.3679 2.9610 2.5466 1.3617 1.6002 2.4369 1.3583 1.6411 2.7014 2.2389 1.4733 1.7001 2.5031 1.3478 1.3665 3.6263 3.2050 1.6314 1.3011 2.0344 2.1782 1.5044 2.8069 2.6947 1.5535 1.1368 1.1243 1.6007 2.0410 1.8448 1.5270 2.8972 1.9374 1.5671 1.4995 1.7841 1.8347 2.2451 6.5232 1.0491 1.1188 4.2061 1.9059 1.0997 1.0916 2.5277 2.3156 2.2437 2.4649 2.5788 5.7953 5.8120 4.7801 5.7367 5.0555 1.0521 1.0480 1.0810 1.0846 1.1016 1.1013 1.0877 1.0887 1.0932 1.0920 1.0925 1.0960 1.0995 1.0906 1.0943 1.0985 1.0803 1.0763
irintensity: 1.2315 0.3333 0.5429 0.8128 0.7149 5.9578 0.8949 1.1782 1.0624 3.9847 1.6371 5.4103 6.8286 3.1653 7.8381 13.1481 124.3026 29.8435 18.5763 4.9753 10.9724 1.9990 10.5437 5.8250 6.6371 5.5621 12.1822 1.5333 2.2871 0.5920 11.1455 7.4010 49.4821 17.0301 57.2410 39.9143 30.0222 12.2751 7.8206 20.4781 4.5066 2.5330 38.6844 1.2678 37.0268 5.6560 6.9662 3.8231 2.4960 0.1349 2.9504 1.7586 0.9126 0.4141 6.8449 9.4823 9.8038 109.4020 64.4171 87.4779 3.0746 1.0884 16.4361 1.7466 19.2439 55.3994 50.6129 156.0818 186.5709 99.3815 0.8590 169.5526 0.8839 1.1203 2.2658 24.9295 563.4449 7.5683 12.9899 14.4099 33.8393 18.6484 40.3823 264.9377 25.6076 306.4832 190.4098 434.0212 25.1647 27.4435 5.4016 0.9440 8.1381 12.3043 16.3876 20.3580 7.8057 1.3912 3.8835 8.9638 2.0840 17.7706 8.9350 0.1137 0.6024 10.4505 243.8839 77.0394
temp: 298.150 k
press: 1.00000 atm
elementType: 6 6 6 6 6 1 6 1 6 6 1 1 1 7 5 6 1 1 1 6 1 1 1 6 7 1 6 6 6 6 1 6 1 6 1 1 1 1
symmnumber: 1
zpe: 830669.2 jmol-1
zpe.correction: 0.316385 hartree
zpe.thermalcorrener: 0.334170 hartree
zpe.thermalcorrenthalpy: 0.335115 hartree
zpe.thermalcorrgfe: 0.270285 hartree
zpe.sumelectzpe: -792.470501 hartree
zpe.sumelectthermal: -792.452716 hartree
zpe.sumelectthermalent: -792.451772 hartree
zpe.sumelectthermalfe: -792.516601 hartree
dipole: -11.4384 6.5922 0.7128
dipole: 13.2213
quadrupole: -37.3727 -74.9864 -116.1942
quadrupole: -7.3609 0.9257 5.5406
quadrupole: 38.8118 1.1980 -40.0098 -7.3609 0.9257 5.5406
hfenergy: -792.7868863 hartree
pointgroup: C01 [X(C17H18B1N2)]
dipole: 3.3508902 1.9366349 0.6917461 debye
polarizability: 367.2102035|70.8364826|294.9208565|21.7645208|27.4880414|161.5057979 unknown
InChI: InChI=1/C17H18BN2/c1-18(2)16-12-15(20-14-8-4-3-5-9-14)11-13-7-6-10-19-17(13)16/h3-12,19-20H,1-2H3
charge 1 multiplicity 1
38 atoms
C  -4.13571565 0.03334905 -0.13478816
C  -2.77101351 -0.01684337 0.03971701
C  -2.10271835 1.23509236 0.14758571
C  -2.81420758 2.45964041 0.08981497
C  -4.2105416 2.44214459 -0.0774538
H  -4.68063191 -0.89946108 -0.20556875
C  -2.0818699 3.6654869 0.18428641
H  -4.74365737 3.38523959 -0.12457671
C  -0.71522042 3.65881211 0.32864021
C  -0.05320901 2.43780025 0.37852133
H  -2.61610734 4.60814553 0.13961062
H  -0.14595895 4.57448986 0.40246425
H  1.01830916 2.34606489 0.48946633
N  -0.74341787 1.30720286 0.28539025
B  -2.10433293 -1.44862393 0.18984053
C  -0.79664653 -1.69114223 1.03644408
H  -0.81244737 -2.68900247 1.48373756
H  0.07160502 -1.71448227 0.35744233
H  -0.59072877 -0.9723441 1.83527796
C  -2.79456227 -2.6830374 -0.48183129
H  -2.06849315 -3.45262898 -0.75866897
H  -3.43814116 -3.15104303 0.27889858
H  -3.42615542 -2.45908695 -1.34416562
C  -4.88949441 1.24346829 -0.1949089
N  -6.25120318 1.22231431 -0.33566464
H  -6.73804082 2.08168574 -0.13831883
C  -7.06227085 0.11011185 -0.66689114
C  -8.23275452 -0.10884334 0.05691739
C  -6.73787838 -0.73127681 -1.73086155
C  -9.06919011 -1.16566766 -0.27817199
H  -8.48213893 0.54930603 0.88214724
C  -7.56594704 -1.80200406 -2.04242331
H  -5.84968012 -0.53927818 -2.32262664
C  -8.73404606 -2.02211889 -1.32078012
H  -9.98032315 -1.32540485 0.28647631
H  -7.3062058 -2.45448867 -2.86796681
H  -9.38299586 -2.85171561 -1.57458159
H  -0.23363588 0.43238526 0.32775776
