program: Gaussian 16
title: me_xanthene_prot
version: AS64L-G16RevC.02
method: RwB97XD
basis: GenECP
operation: Freq
keyword: #N
keyword: Geom=AllCheck
keyword: Guess=TCheck
keyword: SCRF=Check
keyword: GenChk
keyword: RwB97XD/GenECP
keyword: Freq
converged: YES YES NO NO
title: Mulliken charges:
elementType: C C C C C C H H H C O C H H H C H H H C C C C C H C H H B N C H H H C H H H C H H H C H H H H
charge: 0.148584 -0.001954 -0.634968 -0.471679 0.469007 0.071111 0.246582 0.260668 0.174197 0.021810 -0.048453 -0.592692 0.174017 0.183552 0.215335 -0.775928 0.200982 0.197200 0.207983 0.116208 -0.069909 -0.044728 0.507719 -0.547158 0.186328 -0.794414 0.281064 0.209611 0.329022 0.082680 -0.790073 0.165937 0.201094 0.174942 -0.799920 0.218936 0.127735 0.181617 -0.425082 0.264482 0.248531 0.253745 -0.357896 0.255236 0.226091 0.255890 0.496957
chargesum: 1.00000
title: Mulliken charges with hydrogens summed into heavy atoms:
elementType: C C C C C C C O C C C C C C C C B N C C C C
charge: 0.148584 0.244628 -0.374300 -0.297481 0.469007 0.071111 0.021810 -0.048453 -0.019788 -0.169763 0.116208 -0.069909 0.141600 0.507719 -0.266094 -0.584802 0.329022 0.579637 -0.248100 -0.271631 0.341675 0.379321
1716.lowfreq: -13.5503 -0.0003 0.0005 0.0006 9.7995 16.3495 30.3752 49.4015 56.6261
frequency: 22.6521 48.9357 56.4048 92.6295 99.7326 131.4693 149.8749 161.3594 163.1873 184.7824 189.8094 239.3611 248.7669 266.5615 276.6425 285.4712 291.9882 303.7620 317.0040 319.4560 335.2045 347.2406 348.2702 366.1896 383.3672 416.8160 420.0171 454.2719 472.8974 487.4083 527.0746 539.1405 552.5620 564.8258 589.0059 608.7607 626.9991 648.8984 687.9548 723.4507 729.7348 770.1331 775.9311 795.5087 819.9221 822.8461 836.2976 853.4791 862.2859 887.6217 905.9975 935.2454 951.5329 956.3154 957.9095 963.1663 1000.6308 1013.4792 1018.4129 1034.9525 1038.6637 1079.8926 1090.6824 1113.4643 1119.9145 1140.5041 1163.0191 1173.7780 1187.5008 1195.3363 1203.2763 1218.3806 1224.7121 1240.1314 1263.9951 1279.8516 1286.9463 1297.4180 1321.5887 1323.1784 1327.4257 1331.6143 1340.9631 1348.2917 1405.0958 1430.4120 1435.2442 1444.2619 1451.4801 1468.9258 1470.4779 1475.6151 1478.5470 1486.1000 1489.4808 1494.4013 1499.2075 1502.1727 1515.8202 1517.2717 1521.0952 1522.7354 1526.7179 1538.1875 1548.7754 1560.8867 1645.6490 1666.5825 1684.5509 1703.0927 3018.0708 3024.2962 3043.1682 3064.3134 3088.0445 3089.1630 3092.2701 3103.5053 3123.0572 3126.8479 3131.8757 3132.1356 3143.0279 3148.5167 3192.7485 3195.9166 3201.9279 3206.7663 3210.8748 3212.6892 3215.6763 3227.0530 3228.2748 3236.8650 3401.6818
redmass: 3.6466 2.1389 2.7839 1.9316 2.1015 3.6181 3.4285 2.8985 2.1349 2.5546 3.7042 1.4120 4.1764 2.4930 1.5825 1.7069 1.4808 2.7922 2.4206 2.7458 1.3028 1.3357 2.4196 1.9154 3.7326 3.0804 3.0190 3.4496 3.1274 2.8740 3.8889 4.2189 3.5208 3.7528 4.6047 4.6892 3.5057 4.1218 6.5142 3.2203 1.5129 1.9693 2.2299 2.9155 1.9454 2.4228 4.1111 1.5023 2.8834 2.1751 5.9788 2.0717 1.5866 1.4497 1.9635 1.5009 2.2930 1.3545 1.3449 1.3277 2.1209 2.4502 1.2909 2.3619 2.1585 2.3523 2.0552 2.6477 2.2600 1.4208 1.7178 1.5325 1.6519 2.2579 2.8420 1.8556 2.2511 2.6703 2.3526 2.6755 1.5511 2.7541 1.7202 4.1718 1.2178 1.2302 1.4011 1.0663 1.3329 1.7039 1.1532 1.1147 1.0435 1.1378 1.0569 1.2113 1.2150 1.1312 1.1470 1.5996 1.2297 1.2673 1.4362 1.2313 2.3203 1.0874 5.4495 7.4124 7.5161 7.1104 1.0461 1.0395 1.0341 1.0370 1.0773 1.0429 1.0852 1.0305 1.1016 1.1037 1.1031 1.1024 1.1016 1.1026 1.1086 1.0881 1.1089 1.1075 1.1044 1.0922 1.0908 1.0932 1.0951 1.0959 1.0759
irintensity: 0.3012 0.6679 0.5282 3.4286 2.9941 0.5423 0.5584 0.3723 2.5598 0.7948 5.8372 0.0465 2.2934 3.0666 0.0909 0.8352 0.1716 0.8355 0.3637 0.3442 0.6384 0.2151 1.2238 0.0541 1.2687 0.5706 3.0028 10.8884 3.9919 13.5391 2.9116 6.9629 3.4002 2.6069 2.3992 2.4285 2.6572 1.1973 1.2096 3.3094 9.6171 24.0405 55.8135 7.4171 20.4321 14.1443 12.4222 0.1756 1.1013 6.5895 45.0414 15.3093 4.0260 0.9967 5.3594 3.4489 38.2390 0.5972 0.6461 0.2340 20.3986 20.1052 7.3764 20.5075 68.3543 35.0942 12.4055 9.4209 8.7224 32.3831 3.8708 25.7535 49.5615 101.9053 102.0305 54.7747 18.7315 127.3137 3.1364 88.7826 64.9612 119.3838 50.9928 31.6799 11.9575 11.2250 159.5470 12.8176 172.1325 124.0450 31.6011 45.2701 0.0422 2.1746 18.3896 15.4316 15.4815 0.4228 3.0076 0.8414 2.7757 26.3021 43.9148 29.9485 99.6739 21.4084 24.5602 16.6433 50.6170 2.7686 0.8099 21.8939 20.9773 17.4785 8.5907 13.6826 17.5272 2.3245 37.3027 21.2957 17.4278 26.7838 29.8696 19.0712 4.6300 2.8836 2.2780 0.9918 1.6728 8.0255 0.5133 1.4266 11.1225 2.5739 319.1654
temp: 298.150 k
press: 1.00000 atm
elementType: 6 6 6 6 6 6 1 1 1 6 8 6 1 1 1 6 1 1 1 6 6 6 6 6 1 6 1 1 5 7 6 1 1 1 6 1 1 1 6 1 1 1 6 1 1 1 1
symmnumber: 1
zpe: 1073610.7 jmol-1
zpe.correction: 0.408917 hartree
zpe.thermalcorrener: 0.429866 hartree
zpe.thermalcorrenthalpy: 0.430810 hartree
zpe.thermalcorrgfe: 0.360804 hartree
zpe.sumelectzpe: -893.281915 hartree
zpe.sumelectthermal: -893.260966 hartree
zpe.sumelectthermalent: -893.260022 hartree
zpe.sumelectthermalfe: -893.330028 hartree
dipole: -25.1026 12.5137 -4.6557
dipole: 28.4325
quadrupole: 37.6500 -72.7363 -116.2050
quadrupole: -55.7143 33.2788 -19.8068
quadrupole: 88.0805 -22.3059 -65.7746 -55.7143 33.2788 -19.8068
hfenergy: -893.6908319 hartree
pointgroup: C01 [X(C19H25B1N1O1)]
dipole: -3.3974074 -0.6015587 -1.22145 debye
polarizability: 296.3552437|21.2602604|285.9497615|43.2024509|-53.8366395|227.9665096 unknown
InChI: InChI=1/C19H25BNO/c1-19(2)13-9-7-11-15(20(3)4)17(13)22-18-14(19)10-8-12-16(18)21(5)6/h7-12,21H,1-6H3
charge 1 multiplicity 1
47 atoms
C  -2.05554125 1.3978735 1.03794757
C  -0.70910566 1.30016194 1.40987139
C  0.20284298 2.29780829 1.09808544
C  -0.22545554 3.44472735 0.44669488
C  -1.56316247 3.62306587 0.09236735
C  -2.4316718 2.57815053 0.39003368
H  -0.36802341 0.41452059 1.93489384
H  1.2448715 2.19193002 1.37467339
H  0.49526641 4.22403573 0.2344963
C  -2.08616314 4.93597372 -0.49400863
O  -3.78283364 2.69969113 0.08509674
C  -1.03536844 5.61995297 -1.37690933
H  -1.41595207 6.56114458 -1.7764167
H  -0.14757356 5.87473854 -0.79741067
H  -0.73657154 4.98036838 -2.21048221
C  -2.45813767 5.8724891 0.67940119
H  -1.57234618 6.08220862 1.28378415
H  -2.85516802 6.81762435 0.29922845
H  -3.21188492 5.41585581 1.32590483
C  -3.36041401 4.64941466 -1.27859701
C  -4.1410177 3.56409388 -0.9008752
C  -3.85630398 5.461679 -2.29642654
C  -5.36507897 3.31306039 -1.51053665
C  -5.08482908 5.2178976 -2.89972621
H  -3.28232724 6.31962909 -2.62177196
C  -5.85862765 4.13604335 -2.50423838
H  -5.44363418 5.87706779 -3.67962387
H  -6.81818763 3.94447544 -2.96899679
B  -2.99807018 0.16747869 1.30011414
N  -6.09953489 2.13664324 -1.02637678
C  -2.76465174 -0.73286991 2.56423744
H  -3.68302591 -1.21975973 2.90560011
H  -2.09421269 -1.55129804 2.26023497
H  -2.28831679 -0.22795643 3.40735865
C  -4.12080704 -0.27274935 0.27716081
H  -4.15972658 -1.36337812 0.19192963
H  -5.10255749 0.00625324 0.69235939
H  -4.00685647 0.14351746 -0.72781345
C  -7.24877779 2.50653796 -0.14330454
H  -7.98452739 3.04289751 -0.73926841
H  -7.67907592 1.59253222 0.26361421
H  -6.87500773 3.14159178 0.65695723
C  -6.5006333 1.19377076 -2.11251006
H  -6.87048851 0.28168151 -1.64805356
H  -7.28288227 1.65179715 -2.713879
H  -5.62771182 0.98060291 -2.72500391
H  -5.42160763 1.63710896 -0.4373469
