program: Gaussian 16
title: no2_benzopiperidine_prot
version: AS64L-G16RevC.02
method: RwB97XD
basis: GenECP
operation: Freq
keyword: #N
keyword: Geom=AllCheck
keyword: Guess=TCheck
keyword: SCRF=Check
keyword: GenChk
keyword: RwB97XD/GenECP
keyword: Freq
converged: YES YES YES YES
title: Mulliken charges:
elementType: H C C C C H C H H B H C N C C C H H C H H C H H H H H H N N O O O O
charge: 0.270120 -0.406012 -0.439625 -0.491345 -0.128484 0.257201 -0.225451 0.281310 0.231749 0.483373 0.111026 0.289857 0.193049 -0.325584 -0.151701 -0.282665 0.261369 0.269115 -0.432806 0.303023 0.228843 -0.604423 0.270195 0.224785 0.256386 0.237375 0.252841 0.173949 -0.471797 -0.291316 0.041027 0.164539 0.143989 0.306088
chargesum: 1.00000
title: Mulliken charges with hydrogens summed into heavy atoms:
elementType: C C C C C B C N C C C C C N N O O O O
charge: -0.135892 -0.182424 -0.210035 -0.128484 0.006298 0.483373 0.289857 0.304075 0.204900 0.380165 0.212315 0.060954 -0.177633 -0.471797 -0.291316 0.041027 0.164539 0.143989 0.306088
1716.lowfreq: -0.0003 0.0005 0.0006 18.5820 27.8417 35.5737 65.8672 73.5814 84.7394
frequency: 64.9386 72.8202 84.2212 104.1217 107.8472 122.0524 138.5430 179.4771 207.6485 217.1209 258.3460 263.6247 294.4161 305.1046 323.7778 348.6112 365.6227 409.9118 472.0294 489.6584 498.0413 507.0256 551.3728 560.9657 601.8845 648.8083 657.0659 698.2866 744.6557 770.2793 795.4805 800.9354 816.6508 833.5474 857.9445 898.6879 912.7983 917.8549 936.0362 973.9812 983.0567 1009.9013 1034.3951 1041.3863 1047.6111 1053.7755 1060.0950 1093.6344 1110.1448 1138.6936 1170.2001 1187.1334 1210.2668 1220.9187 1240.3728 1247.1405 1270.6019 1302.3103 1313.5958 1320.6452 1345.5205 1368.4756 1373.7182 1406.7494 1409.8390 1418.5566 1436.4631 1454.0136 1483.7771 1489.0949 1495.2882 1504.9666 1518.9710 1526.3939 1539.0551 1562.6124 1576.4326 1648.4977 1651.8206 1694.6552 1863.0496 3053.1432 3060.9251 3065.8327 3107.2949 3109.2993 3125.1785 3126.3452 3129.2729 3173.9885 3184.3537 3204.4489 3217.9285 3229.7866 3238.3234 3267.4150
redmass: 7.9034 9.5249 4.5441 4.2386 3.8273 9.0099 5.6595 8.7470 6.5773 4.7233 5.4552 4.6909 2.2598 7.3765 3.7397 4.4967 5.6075 2.4146 3.1825 4.2377 3.2975 7.9030 3.1520 1.9570 9.8225 5.8701 5.1090 8.3452 10.0302 4.0101 1.5474 2.1173 8.3642 1.4780 3.4984 1.7407 1.5940 2.0534 1.8751 8.4497 1.4543 1.4123 3.6384 3.6758 1.3999 2.7774 2.0094 2.3054 1.9071 2.3307 1.1022 2.1075 1.1944 4.7233 3.0719 1.5206 2.7629 1.4180 2.9845 1.2143 1.6949 1.3393 1.3502 1.3717 1.4241 1.3985 1.2509 1.2821 1.6650 3.0847 1.3371 1.1756 1.1045 1.1771 1.9189 1.1232 1.4390 6.1628 7.4753 4.4550 14.5592 1.0704 1.0663 1.0646 1.0630 1.0632 1.0952 1.0963 1.1010 1.1095 1.1026 1.0896 1.0903 1.0947 1.0967 1.0809
irintensity: 0.5884 1.9817 1.8896 1.1727 0.1297 0.2078 1.1049 18.0382 6.2279 6.4151 3.2946 0.8619 0.1280 1.0848 0.2916 2.2752 7.2733 1.1940 4.8851 1.9019 10.5186 23.0035 13.5964 5.0628 39.7600 7.9727 12.2469 1.0810 173.2002 7.5980 52.6793 9.9239 64.8417 5.2644 0.1425 22.9587 2.2157 9.2388 5.6871 35.9508 6.9490 8.5695 144.5536 42.7165 6.3592 33.9267 7.4011 0.5132 1.6528 16.3219 7.8202 8.4626 0.4217 84.2374 69.5997 16.5701 127.9971 45.1726 12.2613 1.9886 29.8673 3.3941 2.2326 3.4338 0.3599 0.9563 4.6065 131.2208 62.3273 57.6900 34.8803 2.3191 17.5857 4.5649 14.8394 18.6443 107.3140 153.0164 313.9373 31.1206 216.1690 12.1162 14.0224 17.5217 16.5453 0.3906 14.0379 13.3714 18.3827 14.1040 6.6645 0.9477 1.1977 3.3566 0.3617 522.9387
temp: 298.150 k
press: 1.00000 atm
elementType: 1 6 6 6 6 1 6 1 1 5 1 6 7 6 6 6 1 1 6 1 1 6 1 1 1 1 1 1 7 7 8 8 8 8
symmnumber: 1
zpe: 729300.7 jmol-1
zpe.correction: 0.277776 hartree
zpe.thermalcorrener: 0.293800 hartree
zpe.thermalcorrenthalpy: 0.294744 hartree
zpe.thermalcorrgfe: 0.234652 hartree
zpe.sumelectzpe: -917.546166 hartree
zpe.sumelectthermal: -917.530142 hartree
zpe.sumelectthermalent: -917.529198 hartree
zpe.sumelectthermalfe: -917.589289 hartree
dipole: -3.5937 5.3807 2.0225
dipole: 6.7792
quadrupole: -73.7548 -92.7182 -106.9388
quadrupole: 3.6780 -0.0361 -6.0085
quadrupole: 17.3825 -1.5810 -15.8016 3.6780 -0.0361 -6.0085
hfenergy: -917.8239418 hartree
pointgroup: C01 [X(C11H15B1N3O4)]
dipole: -1.5903739 2.0983261 0.7295901 debye
polarizability: 230.5346872|1.4333068|196.1522909|-3.4978069|-1.5034271|139.7365366 unknown
InChI: InChI=1/C11H15BN3O4/c16-14(17)12(15(18)19-12)10-6-2-3-7-11(10)13-8-4-1-5-9-13/h2-3,6-7,13H,1,4-5,8-9H2
charge 1 multiplicity 1
34 atoms
H  2.87294422 3.70274288 -0.37415632
C  2.04043663 3.0175443 -0.27456551
C  2.27493142 1.65263448 -0.19432865
C  0.74042467 3.49585156 -0.2197044
C  1.22581805 0.73080232 -0.07140681
H  3.29862493 1.29723365 -0.23680501
C  -0.32163633 2.60868779 -0.10158055
H  0.54414447 4.55963487 -0.26936938
H  -1.33218069 2.99536972 -0.05953362
B  1.63308812 -0.77106806 0.06629426
H  -0.8896946 -0.62309048 -0.06593637
C  -0.07682562 1.24687528 -0.04250703
N  -1.23304169 0.34003227 0.08279717
C  -1.86854214 0.39170302 1.45188783
C  -2.26241584 0.52610529 -1.01046312
C  -2.93741624 -0.68274316 1.56983294
H  -1.07017287 0.26429155 2.18257202
H  -2.28505561 1.39481524 1.56322088
C  -3.32971 -0.55134859 -0.90647749
H  -1.7232032 0.49149768 -1.95703979
H  -2.69161912 1.51955211 -0.88148071
C  -3.99044203 -0.54935179 0.47118057
H  -3.38815274 -0.59768769 2.56032669
H  -2.46497927 -1.67029324 1.52118567
H  -4.06353457 -0.36532236 -1.69291509
H  -2.88369624 -1.52928218 -1.11568525
H  -4.70859686 -1.36748949 0.54200968
H  -4.55042351 0.38219146 0.60941788
N  1.13727083 -1.81801723 -0.9731541
N  2.91495084 -1.19089364 0.77451975
O  -0.08181887 -2.00671861 -0.96341623
O  1.90696392 -2.38184104 -1.70909743
O  1.83619023 -1.45642286 1.45376985
O  4.01987175 -1.38858207 1.0918597
