program: Gaussian 16
title: no2_metriazole_prot
version: AS64L-G16RevC.02
method: RwB97XD
basis: GenECP
operation: Freq
keyword: #N
keyword: Geom=AllCheck
keyword: Guess=TCheck
keyword: SCRF=Check
keyword: GenChk
keyword: RwB97XD/GenECPFreq
converged: YES YES NO NO
title: Mulliken charges:
elementType: C H C N N N B C H H H N O O N O O H
charge: -0.490645 0.320187 -0.192875 0.229605 0.077815 -0.165674 0.599111 -0.400451 0.266579 0.235747 0.221378 -0.274542 -0.016080 0.024622 -0.178160 0.046620 0.228519 0.468245
chargesum: 1.00000
title: Mulliken charges with hydrogens summed into heavy atoms:
elementType: C C N N N B C N O O N O O
charge: -0.170457 -0.192875 0.229605 0.077815 0.302571 0.599111 0.323252 -0.274542 -0.016080 0.024622 -0.178160 0.046620 0.228519
1716.lowfreq: -28.0877 -0.0010 -0.0006 0.0003 19.5092 26.9118 51.4117 74.8284 101.8291
frequency: 46.8503 73.7265 101.0892 121.1435 141.5591 148.6086 210.2739 225.4480 284.9010 304.6114 332.6522 387.9011 431.9475 495.0891 542.3650 665.0391 701.9826 709.7425 724.0217 758.6930 800.6692 819.7783 920.0699 956.8793 1035.7789 1086.8807 1096.9618 1114.3602 1164.4174 1189.2233 1233.8371 1295.5809 1365.1717 1424.8954 1447.0178 1484.0272 1485.7998 1496.4023 1517.6995 1522.5389 1645.2462 1653.1048 1870.9806 3100.7883 3204.2715 3212.3300 3315.2193 3620.9009
redmass: 12.7978 5.3009 8.6292 3.2763 1.8346 2.6678 5.1740 11.0810 6.7529 9.5220 6.9030 7.3589 4.9809 12.3122 9.9856 6.1600 6.0293 5.2914 8.9052 13.4064 9.7091 1.1390 1.3660 9.7745 11.7060 2.7311 2.7885 2.1633 1.3886 2.4403 4.7515 2.3220 8.5049 3.7911 2.1318 1.7343 1.0628 11.3260 1.3539 2.0350 11.7299 3.8145 14.5879 1.0308 1.1086 1.1094 1.1044 1.0851
irintensity: 1.1419 0.3409 0.1238 4.7083 4.6148 6.6412 3.2760 6.9837 5.8983 4.0831 1.9343 7.1705 4.4939 9.0928 13.5871 10.4461 2.1821 2.7092 15.3394 138.3829 90.2787 86.4827 32.3290 83.7099 142.8024 17.1569 29.2673 15.8572 10.8294 134.6310 180.1882 94.8360 17.4056 17.0687 1.0861 13.9545 23.6889 32.0842 17.5323 15.9992 426.0143 85.7294 232.2061 0.4554 0.1798 1.0594 35.2684 231.3399
temp: 298.150 k
press: 1.00000 atm
elementType: 6 1 6 7 7 7 5 6 1 1 1 7 8 8 7 8 8 1
symmnumber: 1
zpe: 319932.1 jmol-1
zpe.correction: 0.121856 hartree
zpe.thermalcorrener: 0.133381 hartree
zpe.thermalcorrenthalpy: 0.134326 hartree
zpe.thermalcorrgfe: 0.083158 hartree
zpe.sumelectzpe: -716.276517 hartree
zpe.sumelectthermal: -716.264992 hartree
zpe.sumelectthermalent: -716.264047 hartree
zpe.sumelectthermalfe: -716.315215 hartree
dipole: 10.6224 4.9645 -1.0744
dipole: 11.7743
quadrupole: -46.8752 -44.5618 -75.8193
quadrupole: 1.1859 -11.7400 -0.0498
quadrupole: 8.8769 11.1903 -20.0672 1.1859 -11.7400 -0.0498
hfenergy: -716.398373 hartree
pointgroup: C01 [X(C3H5B1N5O4)]
dipole: -2.4125616 1.6521654 -2.5115198 debye
dipolederiv: 0.036108 -0.0038809 -0.1071496 0.0006658 0.0468436 0.1234803 0.0624639 -0.0427644 0.0624013 0.1884374 0.0088686 -0.000016 0.0087479 0.1731831 -0.0048674 0.0102747 0.0053454 0.2159795 -0.1849572 0.1740765 -0.0327044 0.0924105 -0.2388731 -0.0664773 -0.2642537 0.2449182 -0.244727 -0.1095379 0.1218663 0.0483668 0.068621 -0.1384013 -0.036527 0.126644 -0.1423299 0.1220661 -0.0177761 -0.0198964 -0.2272409 -0.0372268 0.0280395 0.2718912 -0.2658278 0.3019197 -0.3840781 -0.1699554 0.1223508 0.2259572 0.1739075 -0.3086784 -0.2613117 0.2562413 -0.321538 0.227896 0.8743683 -0.4901104 0.2286385 -0.3568787 1.8534874 -0.0895214 0.3489904 0.0691131 1.1139553 0.3488507 -0.2761395 0.0185933 -0.1902814 0.4199815 -0.0422556 -0.016776 0.0060331 0.1039912 -0.0096517 -0.0045529 -0.0053503 0.0267421 0.0251174 0.0025824 -0.0054542 0.0005556 0.1315628 0.0982913 0.0433385 -0.0029843 0.0081219 0.0637024 -0.0579347 -0.0419883 -0.020247 0.0558731 0.0910443 0.0406158 0.0116909 0.0014763 0.0648031 0.0724726 0.0478819 0.0320317 0.038395 1.7856248 -0.6826649 -0.0219177 -0.5516878 0.3930007 0.2844451 -0.1981805 0.3473073 0.5335022 -0.9616922 0.3071939 -0.0552171 0.4310534 -0.5326772 -0.1512889 0.3736245 -0.3461789 -0.6620989 -1.1863672 0.3921286 -0.0245816 0.1639775 -0.3537125 -0.1163445 -0.3402316 -0.0112187 -0.4627596 0.8070214 0.6825384 -0.4765278 0.648633 1.3961885 -0.1446041 -0.4802354 -0.1811521 0.3340343 -0.6673331 -0.3067168 0.3506042 -0.0618674 -1.0685543 -0.0513638 0.3707512 0.1444922 -0.4885217 -0.2460237 -0.0919038 0.1386759 -0.4202211 -1.1718833 0.1936779 0.0916684 -0.161107 -0.0867544 0.3235484 -0.0171118 -0.0688371 -0.0061936 0.3484329 0.0739468 -0.0755927 0.0748197 0.3892828 unknown
polarizability: 96.7535004|-23.9386769|115.7166413|5.6784855|-1.4466071|96.3933238 unknown
InChI: InChI=1/C3H5BN5O4/c1-7-2-3(5-6-7)4(8(10)11)9(12)13-4/h2,5H,1H3
charge 1 multiplicity 1
18 atoms
C  2.47308917 1.46604674 1.15154464
H  2.25674706 1.78857486 2.15571767
C  3.27692275 0.45379786 0.68897931
N  1.94399652 2.05251406 0.05255557
N  2.35342319 1.49547262 -1.05244688
N  3.14359978 0.53928101 -0.66339993
B  4.16947253 -0.58754123 1.44146646
C  1.05219997 3.21478326 -0.00376373
H  1.65711546 4.1199704 -0.00064378
H  0.47058605 3.14685372 -0.91918615
H  0.40013307 3.18658222 0.86583604
N  4.74812508 -0.1367639 2.80860883
O  3.96864502 0.47403426 3.52547501
O  5.89397654 -0.41150294 3.08532113
N  3.98245476 -2.09939266 1.30731308
O  4.99940524 -1.58696107 0.65304666
O  3.65582888 -3.21455377 1.34724805
H  3.58863083 -0.02590264 -1.37839303
