program: Gaussian 16
title: no2_nmeimidazole_prot
version: AS64L-G16RevC.02
method: RwB97XD
basis: GenECP
operation: Freq
keyword: #N
keyword: Geom=AllCheck
keyword: Guess=TCheck
keyword: SCRF=Check
keyword: GenChk
keyword: RwB97XD/GenECPFreq
converged: YES YES NO YES
title: Mulliken charges:
elementType: C H C N N B C H H H C H N N O O O O H
charge: -0.337871 0.311614 -0.317673 0.045741 -0.133094 0.658928 -0.392297 0.205807 0.232215 0.265435 0.173339 0.348314 -0.491621 -0.488621 0.112864 0.132619 0.102112 0.115279 0.456911
chargesum: 1.00000
title: Mulliken charges with hydrogens summed into heavy atoms:
elementType: C C N N B C C N N O O O O
charge: -0.026257 -0.317673 0.045741 0.323816 0.658928 0.311160 0.521653 -0.491621 -0.488621 0.112864 0.132619 0.102112 0.115279
1716.lowfreq: -0.0002 0.0006 0.0007 17.1121 26.7004 36.2109 66.8423 77.4210 89.5361
frequency: 65.8630 76.7751 87.3534 96.0459 106.0287 111.1091 139.7977 148.5383 183.6869 256.7006 284.2797 338.0237 420.5642 547.5280 589.0027 615.3979 639.9743 676.8836 698.8950 767.8875 781.1871 829.7449 898.3408 928.0252 961.3492 1071.6084 1076.8816 1112.9471 1119.9161 1159.8989 1216.5857 1276.8287 1328.1638 1404.7454 1430.0725 1472.7128 1496.0860 1500.2730 1512.6889 1513.4788 1541.4405 1602.8526 1628.8097 1654.3254 1674.0994 3091.0925 3187.6093 3206.6481 3297.7485 3302.8596 3644.6480
redmass: 14.7854 12.1056 6.1402 7.4999 1.3227 3.2096 7.1498 11.5910 5.9728 5.1066 4.2068 10.4373 3.2386 9.6879 12.1019 9.2194 2.7873 4.3957 5.3462 11.0621 1.1687 12.5397 1.4302 1.4108 9.1629 5.9467 3.5888 4.4417 1.6263 1.3435 1.2150 1.8684 2.0224 3.9009 3.9957 1.2481 1.3670 1.9594 2.1393 2.0574 7.3341 3.9632 14.4429 14.5926 3.8881 1.0330 1.1076 1.1075 1.1045 1.1037 1.0843
irintensity: 0.6973 0.2177 0.8742 1.3400 0.0513 1.2231 0.8221 20.8672 4.3363 1.0556 1.4018 9.3244 1.0162 20.6914 26.2539 39.3093 38.7997 3.5281 24.8784 87.4729 89.8867 65.4840 21.2261 3.3324 18.2294 8.9871 19.7987 32.1373 23.3735 4.4504 20.1204 308.8018 57.7766 5.5008 98.2853 3.2370 32.9467 112.1718 75.7694 5.0055 26.4738 0.5442 5.5743 845.0652 156.2662 1.9894 0.1217 0.0391 60.7902 16.8843 237.7083
temp: 298.150 k
press: 1.00000 atm
elementType: 6 1 6 7 7 5 6 1 1 1 6 1 7 7 8 8 8 8 1
symmnumber: 1
zpe: 351546.6 jmol-1
zpe.correction: 0.133897 hartree
zpe.thermalcorrener: 0.146211 hartree
zpe.thermalcorrenthalpy: 0.147155 hartree
zpe.thermalcorrgfe: 0.093894 hartree
zpe.sumelectzpe: -700.262444 hartree
zpe.sumelectthermal: -700.250130 hartree
zpe.sumelectthermalent: -700.249186 hartree
zpe.sumelectthermalfe: -700.302447 hartree
dipole: 8.4321 9.6083 -4.1617
dipole: 13.4439
quadrupole: -64.6241 -51.2043 -71.4224
quadrupole: 17.6972 -11.9212 1.6794
quadrupole: -2.2072 11.2126 -9.0054 17.6972 -11.9212 1.6794
hfenergy: -700.3963408 hartree
pointgroup: C01 [X(C4H6B1N4O4)]
dipole: -3.2603365 3.5680226 -3.8131176 debye
dipolederiv: 0.2932803 -0.3260851 0.1781211 -0.3051154 0.4635703 -0.2338065 0.1922521 -0.2320935 0.2303706 0.1552051 0.0223156 -0.0037038 0.0026724 0.1631777 -0.0006445 -0.0195153 0.032779 0.1734448 -0.5106116 0.5887367 -0.3017616 0.5676138 -0.8659163 0.4529673 -0.3345154 0.4724195 -0.2843043 -0.3019199 0.2903938 -0.0939379 0.1253639 -0.4221088 -0.0810618 -0.2577291 0.2374957 -0.4752691 -0.1496485 0.0718665 0.1493535 0.1294026 -0.5313323 -0.1728406 0.2278982 -0.3318096 -0.0340701 1.0160299 -0.5912382 0.5121877 -0.5834618 1.5664188 -0.2949555 0.5245401 -0.4004141 1.2940759 0.3092858 -0.2674365 0.0284009 -0.2278719 0.578859 -0.0718834 -0.0007667 -0.0259967 0.1099423 0.0937864 0.0342132 -0.0301356 -0.0079554 0.0397867 -0.0698119 -0.0643893 -0.0171509 0.0341747 0.0932696 0.043598 0.0158718 0.0159172 0.0476177 0.0587668 0.0483751 0.0089334 0.026326 -0.0055955 -0.0129873 0.0051325 0.0338556 0.0122622 0.0116714 0.0043854 0.0042954 0.1311123 0.136781 -0.0417461 -0.2128573 0.0245026 0.4112134 0.3590151 -0.1195267 0.1941809 0.1701295 0.1836398 0.0209163 0.0138635 0.0349475 0.1361012 0.0114142 0.0313541 -0.0219218 0.2388066 1.7259215 0.3250626 -0.4013548 0.3553584 0.128343 0.0659391 -0.3878561 0.0516731 0.7929558 1.5413475 0.378946 -0.6317332 0.4421219 0.8131743 -0.0562594 -0.6337253 -0.0066306 0.3230554 -0.8240906 -0.1618129 0.2102527 -0.4451447 -0.9221742 0.1447881 0.1607559 -0.0636316 -0.2856739 -1.0282668 -0.1142676 0.324956 0.1911773 -0.5252875 -0.0799243 0.4535943 0.002454 -0.4007403 -1.134276 -0.1598548 0.1006382 -0.3059086 -0.2783453 -0.031486 -0.2550743 -0.0554609 -0.5477326 -0.9072971 -0.0990129 0.1791753 -0.0394671 -0.2183626 -0.0932939 0.4697427 0.0651502 -0.825637 0.3131592 -0.0016072 -0.042469 -0.0080083 0.4030028 0.0814058 -0.0397996 0.0857283 0.3290334 unknown
polarizability: 110.8600871|-20.9293497|119.5502963|9.7088581|-4.3368723|109.9697641 unknown
InChI: InChI=1/C4H6BN4O4/c1-7-2-4(6-3-7)5(8(10)11)9(12)13/h2-3,6H,1H3
charge 1 multiplicity 1
19 atoms
C  2.68852065 1.57263058 1.078439
H  2.73100762 2.12437981 2.00469053
C  3.22356053 0.35121926 0.75691058
N  2.02061329 2.04071154 -0.01372771
N  2.84242375 0.12105963 -0.55865172
B  4.03541818 -0.57163681 1.63416915
C  1.32277037 3.33132662 -0.10309144
H  0.66497897 3.31667351 -0.96899963
H  0.73415372 3.46980385 0.80094953
H  2.05806599 4.12787135 -0.20458098
C  2.12963199 1.14036419 -0.99695532
H  1.70003282 1.22964925 -1.9819663
N  4.41661366 -0.15834178 3.04078385
N  4.49186524 -1.93968408 1.1779438
O  3.68592355 -2.8315319 1.3701675
O  5.57463038 -2.04032802 0.6424355
O  5.57028972 0.18744614 3.19677496
O  3.54037619 -0.17334704 3.88224632
H  3.05477245 -0.70166584 -1.10960871
