program: Gaussian 16
title: Me_Ph-H+
version: ES64L-G16RevC.01
method: RwB97XD
basis: GenECP
operation: Freq
keyword: #N
keyword: Geom=AllCheck
keyword: Guess=TCheck
keyword: SCRF=Check
keyword: GenChk
keyword: RwB97XD/GenECPFreq
converged: YES YES YES YES
title: Mulliken charges:
elementType: C C C C C C H H H H N B C C C C C C H H C C C C C C H H C H H H C H H H H H H H H H H
charge: -0.483304 -0.198230 0.168404 0.375026 -0.232519 -0.585022 0.272179 0.270890 0.226956 0.267994 -0.024299 -0.046223 0.334551 -0.139717 -0.028370 -0.466758 -0.347069 -0.453408 0.264224 0.259767 0.159800 -0.415939 0.120517 -0.410106 -0.446778 -0.462850 0.265609 0.272491 -0.386319 0.218779 0.240088 0.256981 -0.424867 0.243683 0.246897 0.255396 0.411974 0.219883 0.218062 0.234740 0.244864 0.245101 0.256926
chargesum: 1.00000
title: Mulliken charges with hydrogens summed into heavy atoms:
elementType: C C C C C C N B C C C C C C C C C C C C C C
charge: -0.211125 0.072659 0.168404 0.375026 -0.005564 -0.317028 0.387675 -0.046223 0.334551 0.080166 0.189692 -0.202535 -0.087302 -0.218667 0.159800 -0.159013 0.365380 -0.144497 -0.174287 -0.217749 0.329528 0.321107
1716.lowfreq: -9.1349 -0.0004 -0.0003 -0.0003 14.9831 18.6079 39.0508 53.9268 59.7410
frequency: 33.6969 53.5369 59.3178 65.4679 74.5235 90.1809 101.0296 125.0509 164.5813 183.6725 196.1099 225.3310 242.1069 263.7784 269.1222 284.5686 312.9304 341.1671 371.2809 415.5471 425.6551 429.9847 467.6104 473.4383 502.7020 562.9818 592.6565 621.1722 626.2347 635.6744 638.1463 662.5017 697.7623 722.9257 730.5837 764.0161 768.3752 781.0529 796.7948 798.1543 887.8162 893.4147 899.6232 908.1661 920.7076 946.9006 978.9056 983.4103 1003.6738 1021.3947 1022.3572 1024.8262 1028.0846 1035.3762 1039.8329 1040.6855 1047.1007 1060.1662 1063.9709 1078.3525 1079.5865 1107.3012 1113.6972 1121.7316 1162.5397 1173.7771 1191.0536 1193.5051 1193.9917 1202.1581 1213.5222 1223.6293 1230.0253 1261.0926 1278.0267 1291.4281 1304.6357 1315.7032 1326.1724 1335.9920 1358.5281 1366.8748 1440.6834 1460.3732 1464.9525 1472.2180 1477.0951 1480.9796 1488.9820 1500.1192 1503.6226 1506.0367 1519.8697 1528.6594 1536.4785 1542.1598 1633.8330 1637.1879 1641.2378 1664.7760 1667.4826 1686.3945 3085.1374 3093.3528 3179.6184 3184.6838 3188.1441 3188.2831 3191.4450 3191.9833 3196.0641 3198.7762 3199.6914 3201.7377 3203.9921 3209.0247 3209.5219 3212.2733 3218.1948 3218.5525 3219.4371 3230.3193 3348.2302
redmass: 4.0194 4.2873 3.9651 4.5071 4.4470 3.5325 3.0638 2.0042 4.1615 2.5916 4.6426 3.1254 2.4532 4.1982 1.2700 2.8983 3.2206 3.0660 3.1036 2.8448 2.9238 3.6343 3.6960 3.7973 3.6454 3.4273 3.5234 6.0209 6.0644 6.3815 6.4858 4.6739 5.7621 1.6930 1.7879 2.4507 2.7065 2.2952 1.6135 2.2504 1.2417 1.2859 2.2458 2.6918 3.3023 3.3221 1.3602 1.3616 1.3785 5.8760 4.6382 1.4877 1.3864 2.0609 1.3476 1.3188 1.3325 2.3244 2.1177 1.9513 1.3641 2.3322 1.8600 1.6994 1.6445 2.4487 1.1401 1.1356 1.8803 1.1356 1.1300 1.1344 1.6073 3.1290 2.1540 2.9964 2.4373 3.4197 3.8881 2.9979 1.6178 1.5404 1.1768 1.2636 1.2367 2.0812 2.1243 1.1850 1.1763 1.7699 1.1037 1.0934 1.0707 2.1724 2.2043 1.7733 5.0612 5.0319 5.2530 5.6669 5.5878 5.4992 1.0313 1.0317 1.0885 1.0877 1.1069 1.0901 1.0876 1.1075 1.1081 1.0910 1.0910 1.0890 1.1065 1.0953 1.0951 1.0911 1.0995 1.0947 1.0995 1.0989 1.0761
irintensity: 1.5024 0.1887 1.6989 0.1697 1.0826 1.0209 0.0798 1.7629 10.6176 1.0559 2.6934 0.6359 2.1128 0.1144 0.4562 0.9688 0.4619 0.9271 1.3441 2.3057 2.3148 2.5204 0.5631 0.4512 2.5923 19.3170 4.0461 22.9933 20.7167 3.3190 0.9555 37.8865 2.2603 68.4041 52.5523 26.6997 19.1367 15.1000 48.7559 15.7111 2.3772 0.9089 12.2819 32.9823 21.5277 15.2521 1.0140 0.1782 0.3786 6.0113 2.6585 1.9931 2.1507 18.1342 0.6496 0.1394 0.4275 1.3073 3.6250 3.7777 1.0140 10.5216 4.7270 3.6485 10.6558 3.5213 1.4864 2.4168 4.2604 0.1773 19.4303 17.9791 7.7089 194.8704 46.3965 248.6746 89.0190 99.4730 34.7374 24.7044 7.3688 6.2204 3.7568 29.3668 12.3170 22.7332 38.2721 9.0447 22.2102 29.5191 18.3585 9.6010 32.0975 2.2804 11.8883 20.1632 1.4586 3.1836 11.7421 43.3380 82.7452 54.8923 3.9941 3.5020 3.4462 6.1166 3.1414 2.9608 1.5066 4.2609 4.3957 3.4368 1.5791 0.3644 3.2766 20.8386 16.2639 0.1831 15.0933 7.4428 11.5714 4.5883 544.7279
temp: 298.150 k
press: 1.00000 atm
elementType: 6 6 6 6 6 6 1 1 1 1 7 5 6 6 6 6 6 6 1 1 6 6 6 6 6 6 1 1 6 1 1 1 6 1 1 1 1 1 1 1 1 1 1
symmnumber: 1
zpe: 966120.7 jmol-1
zpe.correction: 0.367976 hartree
zpe.thermalcorrener: 0.386927 hartree
zpe.thermalcorrenthalpy: 0.387871 hartree
zpe.thermalcorrgfe: 0.320366 hartree
zpe.sumelectzpe: -853.771177 hartree
zpe.sumelectthermal: -853.752226 hartree
zpe.sumelectthermalent: -853.751282 hartree
zpe.sumelectthermalfe: -853.818787 hartree
dipole: 8.7653 18.6895 -1.0186
dipole: 20.6680
quadrupole: -79.7673 -32.8868 -105.4007
quadrupole: 29.3559 -4.0336 -15.3570
quadrupole: -7.0823 39.7981 -32.7158 29.3559 -4.0336 -15.3570
hfenergy: -854.139153 hartree
pointgroup: C01 [X(C20H21B1N1)]
dipole: -1.6411819 2.7770157 -0.5569046 debye
polarizability: 319.0366585|-14.3975245|246.0397747|-7.7692616|-58.4014372|288.1069676 unknown
InChI: InChI=1/C20H21BN/c1-22(2)20-16-10-9-15-19(20)21(17-11-5-3-6-12-17)18-13-7-4-8-14-18/h3-16,22H,1-2H3
charge 1 multiplicity 1
43 atoms
C  -0.76698984 1.08208377 0.75803836
C  0.61524472 0.99040274 0.66700009
C  1.40864147 2.08624791 0.29570182
C  0.72317927 3.27793018 0.03420903
C  -0.64923963 3.4081995 0.1594855
C  -1.39900799 2.29411822 0.51615136
H  -1.34947553 0.2111112 1.03316596
H  1.09939579 0.0441797 0.88050423
H  -1.14793227 4.35458342 -0.00992637
H  -2.4747459 2.38109119 0.60740745
N  1.52168708 4.4780237 -0.31890619
B  2.97368248 1.89570899 0.16756349
C  3.74409025 1.12441038 1.26870937
C  4.95889358 0.47363405 0.98672407
C  3.25629332 1.05148896 2.58621625
C  5.64710404 -0.22408601 1.9688663
C  3.95481483 0.3781805 3.57808456
C  5.14858473 -0.26560269 3.26732445
H  6.57255137 -0.73340837 1.72612163
H  3.56814173 0.34614757 4.59020854
C  3.70794457 2.51399756 -1.07219866
C  3.0945571 2.52297681 -2.33990399
C  4.9882119 3.08488554 -0.96265703
C  3.73661255 3.05927473 -3.44781239
C  5.62115029 3.647762 -2.06346415
C  4.99854543 3.62942623 -3.30742584
H  3.25754867 3.03251982 -4.41968033
H  6.60404146 4.0915552 -1.95525341
C  0.98145688 5.26049613 -1.46887767
H  0.04941795 5.74074088 -1.18149334
H  1.71636885 6.0175871 -1.73597489
H  0.81959831 4.58104062 -2.30294635
C  1.79439076 5.33938202 0.87089876
H  2.48960816 6.12543046 0.57848456
H  0.85462938 5.76822061 1.21333911
H  2.22683344 4.71879359 1.65380443
H  2.42822511 4.11061749 -0.63902626
H  5.35830712 0.49834535 -0.02150561
H  2.32059317 1.53915883 2.84018626
H  5.68986537 -0.80304138 4.03798978
H  5.48818983 3.09150052 0.00011508
H  5.4992832 4.05544778 -4.16943847
H  2.10773435 2.08391944 -2.45893593
