program: Gaussian 16
title: cl_benzopiperidine_hydride
version: AS64L-G16RevC.02
method: RwB97XD
basis: GenECP
operation: Freq
keyword: #N
keyword: Geom=AllCheck
keyword: Guess=TCheck
keyword: SCRF=Check
keyword: GenChk
keyword: RwB97XD/GenECP
keyword: Freq
converged: YES YES NO YES
title: Mulliken charges:
elementType: H C C C C H C H H B H C N C C C H H C H H C H H H H H H Cl Cl
charge: 0.191465 -0.576622 0.080829 -0.327998 0.559350 0.165252 -0.037212 0.200097 0.150316 -0.649855 0.001749 -0.804037 0.506534 -0.352674 0.012659 -0.300693 0.163032 0.134133 -0.625287 0.185903 0.121823 -0.306087 0.175780 0.157735 0.168228 0.159923 0.183002 0.127400 -0.255670 -0.209075
chargesum: -1.00000
title: Mulliken charges with hydrogens summed into heavy atoms:
elementType: C C C C C B C N C C C C C Cl Cl
charge: -0.385157 0.246082 -0.127901 0.559350 0.113103 -0.648107 -0.804037 0.506534 -0.055509 0.320385 0.032822 -0.297136 0.004316 -0.255670 -0.209075
1716.lowfreq: -25.4492 -21.7957 0.0019 0.0021 0.0026 12.9124 49.7861 69.7930 90.9845
frequency: 49.0159 67.3168 90.7544 108.6894 119.4524 154.7053 186.6664 219.5019 249.7984 278.5890 287.2996 307.8929 337.9253 403.7419 457.0224 475.3986 479.7541 507.6819 564.0678 579.8939 609.1161 634.7768 642.5149 745.7049 763.2992 797.1323 798.9733 838.4432 856.5288 879.0121 892.9468 932.8740 960.6156 973.9498 985.8783 1012.4352 1032.3697 1052.4507 1058.3336 1069.3308 1083.4727 1090.9726 1133.5450 1163.1260 1171.1348 1180.4967 1185.1302 1190.3499 1262.2206 1275.7850 1300.9859 1304.3808 1307.8001 1322.9466 1357.4367 1371.1509 1390.9653 1395.3995 1396.6435 1431.3519 1478.8368 1484.6380 1487.8511 1491.4149 1497.0208 1510.0931 1523.2338 1633.5280 1659.0490 2539.1176 2877.1030 2883.7750 3013.1543 3043.7331 3045.2090 3074.2633 3092.8406 3094.7562 3099.3238 3124.4668 3164.2790 3179.0272 3192.2837 3202.0177
redmass: 13.3748 3.1510 6.8392 4.2872 4.9859 4.1133 9.8222 4.8868 4.1577 2.7837 5.4004 3.0097 3.6122 1.7796 3.5056 2.9996 4.1743 2.4196 3.8224 4.0884 4.9404 5.0083 3.7634 3.6616 1.4250 3.1491 3.8877 1.4333 3.0865 1.4188 1.4377 2.1885 2.9972 1.3756 1.3152 1.2946 1.2185 2.5172 1.3422 1.9173 2.1370 1.4658 1.7504 2.0908 1.8063 1.1682 1.7552 1.6091 1.7677 2.2662 1.2938 1.3604 1.9733 2.6224 1.3055 1.6665 1.5150 1.3708 1.4373 1.6482 2.3438 1.0798 1.1012 1.1083 1.1036 1.1018 2.6957 6.0778 5.8872 1.0904 1.0728 1.0717 1.0662 1.0620 1.0620 1.0944 1.0933 1.0994 1.1016 1.0876 1.0846 1.0902 1.0946 1.0942
irintensity: 0.4264 0.8773 1.0728 1.1770 3.9010 0.3273 4.0266 2.7464 2.2084 1.5274 1.0746 2.8891 1.9868 4.5555 9.8839 5.2950 34.0541 10.1502 39.9554 58.9668 155.3638 54.5864 42.8068 3.9738 44.5113 14.7898 27.9562 2.4606 0.8067 8.2216 0.2050 2.6052 23.8991 3.7456 0.6719 8.0194 101.5623 35.7899 86.5342 9.9224 7.9351 1.2611 39.6147 8.3078 8.3717 9.7267 31.2434 40.1533 83.3698 19.1580 6.1726 2.2876 12.5356 32.3348 1.7659 14.3034 0.2052 4.2163 0.5216 36.4618 54.1423 3.5230 10.9156 12.3261 21.4880 1.9355 82.7075 20.2065 31.8859 225.5255 47.7694 270.0300 58.5910 46.5391 61.7977 96.7973 49.3965 8.0778 82.0772 16.5327 1.6943 35.6107 41.2497 28.2825
temp: 298.150 k
press: 1.00000 atm
elementType: 1 6 6 6 6 1 6 1 1 5 1 6 7 6 6 6 1 1 6 1 1 6 1 1 1 1 1 1 17 17
symmnumber: 1
zpe: 646989.3 jmol-1
zpe.correction: 0.246425 hartree
zpe.thermalcorrener: 0.260253 hartree
zpe.thermalcorrenthalpy: 0.261197 hartree
zpe.thermalcorrgfe: 0.205237 hartree
zpe.sumelectzpe: -1428.157117 hartree
zpe.sumelectthermal: -1428.143288 hartree
zpe.sumelectthermalent: -1428.142344 hartree
zpe.sumelectthermalfe: -1428.198305 hartree
dipole: -8.1164 5.9963 -2.7121
dipole: 10.4492
quadrupole: -127.3755 -127.3691 -119.2644
quadrupole: 11.4413 -8.0258 1.7640
quadrupole: -2.7058 -2.6994 5.4053 11.4413 -8.0258 1.7640
hfenergy: -1428.4035418 hartree
pointgroup: C01 [X(C11H15B1Cl2N1)]
dipole: -3.1413125 2.4275915 -0.7813435 debye
polarizability: 237.8427057|10.9170202|216.1006609|11.2383164|-18.9415145|175.0565768 unknown
InChI: InChI=1/C11H15BCl2N/c13-12(14)10-6-2-3-7-11(10)15-8-4-1-5-9-15/h2-3,6-7,12H,1,4-5,8-9H2
charge -1 multiplicity 1
30 atoms
H  3.38444048 3.05453783 -0.48270292
C  2.44115273 2.52383537 -0.3979854
C  2.40236086 1.26177687 0.19086061
C  1.27251799 3.09033943 -0.8855662
C  1.22229433 0.52430776 0.31466021
H  3.3262501 0.82222082 0.55134557
C  0.07600408 2.39103693 -0.7641237
H  1.28454638 4.07084951 -1.35154519
H  -0.84344387 2.83427837 -1.13308712
B  1.18585375 -0.98152308 0.89680548
H  0.29799475 -1.23017894 1.6652581
C  0.04250262 1.12693921 -0.17197629
N  -1.18602575 0.41605363 -0.06314336
C  -1.841792 0.51482263 1.23100919
C  -2.11701353 0.51835927 -1.16802965
C  -2.8479978 -0.6183131 1.39936617
H  -1.08155487 0.46711863 2.01112014
H  -2.35930872 1.4918994 1.33042883
C  -3.12197718 -0.62944854 -1.09846436
H  -1.55211842 0.47241254 -2.10221317
H  -2.67339815 1.47897499 -1.16168301
C  -3.85155351 -0.62695668 0.24545054
H  -3.36446977 -0.51622291 2.35962193
H  -2.29283062 -1.56221678 1.41456947
H  -3.83552059 -0.54584975 -1.92522254
H  -2.57407698 -1.56995969 -1.21971616
H  -4.51962686 -1.49069552 0.32190018
H  -4.48223004 0.27069981 0.30947705
Cl 1.01441611 -2.21112924 -0.58108132
Cl 2.81427948 -1.43073679 1.82803593
