program: Gaussian 16
title: cl_biphenylene_hydride
version: AS64L-G16RevC.02
method: RwB97XD
basis: GenECP
operation: Freq
keyword: #N
keyword: Geom=AllCheck
keyword: Guess=TCheck
keyword: SCRF=Check
keyword: GenChk
keyword: RwB97XD/GenECP
keyword: Freq
converged: YES YES YES YES
title: Mulliken charges:
elementType: C C C C C C C H C H H C H C H C C H B N C H H H C H H H H Cl Cl
charge: 0.247775 0.474082 0.008403 -0.278428 -0.512223 -0.285431 -0.295743 0.176151 -0.024453 0.215689 0.179631 -0.430514 0.187682 -0.329081 0.207849 -0.517659 0.791829 0.221883 -0.850416 0.213955 -0.376892 0.144035 0.173973 0.157825 -0.472864 0.202484 0.150711 0.094874 0.066722 -0.267833 -0.274015
chargesum: -1.00000
title: Mulliken charges with hydrogens summed into heavy atoms:
elementType: C C C C C C C C C C C C B N C C Cl Cl
charge: 0.247775 0.474082 0.008403 -0.278428 -0.336072 -0.285431 -0.080054 0.155177 -0.242833 -0.121231 -0.295776 0.791829 -0.783694 0.213955 0.098940 -0.024795 -0.267833 -0.274015
1716.lowfreq: -21.1494 -7.3453 -0.0015 -0.0003 0.0010 10.4034 38.9144 64.2596 89.6230
frequency: 38.2037 62.8647 89.3711 100.8540 106.9318 124.5785 159.2608 164.3582 173.7257 243.0308 250.0115 261.5208 293.4019 310.6574 321.2375 359.5552 370.3317 373.9848 460.1912 468.2640 492.2592 548.6802 563.4172 592.4282 605.7870 620.9552 632.0339 656.3108 661.8990 731.2798 743.7732 769.1787 787.3302 804.5277 828.1633 893.4439 905.2365 917.6477 976.0625 992.3011 997.9906 999.2163 1043.0247 1059.6032 1073.3995 1089.3201 1091.6201 1127.0352 1133.2191 1161.0786 1174.8429 1190.3959 1193.6644 1200.6517 1218.2495 1246.9996 1291.0024 1307.7171 1385.9671 1401.8861 1440.5070 1452.8202 1477.4124 1488.6698 1494.2882 1496.4715 1503.7681 1512.8192 1517.4505 1534.8416 1647.1365 1657.8093 1668.7747 1734.2573 2570.3851 2945.8934 2959.9950 3083.1484 3100.8772 3130.9406 3169.6555 3179.2021 3186.6786 3193.2579 3198.7622 3206.8955 3214.8404
redmass: 6.3762 7.8563 6.0603 4.9639 4.8757 2.7332 4.4912 5.8049 5.0534 2.9717 2.3453 7.7921 2.0991 2.1529 1.5669 4.1582 4.7078 3.0041 4.2637 4.4835 5.4137 4.3214 3.5846 5.3961 5.8368 6.3343 5.5685 4.9229 5.3630 2.9397 3.8611 1.4486 1.8238 5.2796 5.7577 1.3960 3.9943 1.3959 1.2977 1.3195 3.3711 5.1850 2.1085 1.4940 1.6939 1.4178 1.2318 1.2994 2.1988 2.0436 1.4662 1.4111 1.5319 3.3262 2.3804 1.9330 2.9174 3.4090 2.8204 2.4258 2.4699 1.2016 1.2701 1.0657 2.1510 1.1413 1.0587 1.4164 6.0822 1.5414 8.8613 9.1045 6.9228 8.3751 1.0896 1.0587 1.0592 1.0735 1.0821 1.1041 1.0858 1.0873 1.0923 1.0954 1.0966 1.0930 1.0938
irintensity: 0.4953 0.6670 2.3184 4.5674 1.9099 2.7097 0.4248 6.4538 0.9428 0.2567 4.0005 2.2449 1.6587 1.8632 8.7162 3.4771 1.0388 3.8251 7.3425 2.3174 55.7144 20.0125 3.3488 116.0290 53.6453 70.3000 13.0079 63.5184 14.1656 49.7331 23.1867 1.1141 72.4359 19.9861 4.9148 1.4124 0.3603 1.6636 1.1623 0.6522 56.4827 31.9275 38.4479 60.5589 23.3906 20.6674 98.9031 3.7061 28.3053 94.5430 24.1880 32.6154 5.1723 8.4429 15.5170 1.4731 17.6273 21.6340 113.0514 25.8287 22.7984 2.7333 27.8647 26.1666 8.0205 23.9794 21.2220 10.6708 6.8519 125.0420 44.1054 18.4906 107.1529 55.3682 155.4228 148.6818 173.4184 44.3037 35.2923 26.0192 4.7423 13.9514 22.3741 5.5049 47.6814 25.4103 28.5887
temp: 298.150 k
press: 1.00000 atm
elementType: 6 6 6 6 6 6 6 1 6 1 1 6 1 6 1 6 6 1 5 7 6 1 1 1 6 1 1 1 1 17 17
symmnumber: 1
zpe: 625703.7 jmol-1
zpe.correction: 0.238318 hartree
zpe.thermalcorrener: 0.254481 hartree
zpe.thermalcorrenthalpy: 0.255425 hartree
zpe.thermalcorrgfe: 0.194320 hartree
zpe.sumelectzpe: -1541.186685 hartree
zpe.sumelectthermal: -1541.170522 hartree
zpe.sumelectthermalent: -1541.169578 hartree
zpe.sumelectthermalfe: -1541.230683 hartree
dipole: -11.7465 1.3044 0.6578
dipole: 11.8370
quadrupole: -163.7801 -122.3314 -138.8833
quadrupole: 13.3695 -0.2158 -2.1429
quadrupole: -22.1151 19.3335 2.7816 13.3695 -0.2158 -2.1429
hfenergy: -1541.425003 hartree
pointgroup: C01 [X(C14H13B1Cl2N1)]
dipole: -4.4730814 0.658337 0.0475828 debye
polarizability: 331.805473|19.3718021|294.7325652|-16.9437494|4.2028417|169.2599924 unknown
InChI: InChI=1/C14H13BCl2N/c1-18(2)12-8-4-6-10-9-5-3-7-11(15(16)17)13(9)14(10)12/h3-8,15H,1-2H3
charge -1 multiplicity 1
31 atoms
C  0.08332469 1.00060639 -0.10300404
C  -0.51983452 2.28649998 -0.10524513
C  -1.87360061 1.66286415 0.08668139
C  -1.29525378 0.37610615 0.04900555
C  -3.20823795 1.89029657 0.29559376
C  -2.05844661 -0.77303875 0.15675372
C  -3.99121518 0.72888894 0.45586535
H  -3.64634677 2.87993609 0.34485525
C  -3.44658948 -0.54175731 0.38014261
H  -5.05872664 0.8248319 0.62693454
H  -4.1136542 -1.38872126 0.48401318
C  0.19714223 3.43984658 -0.22253706
H  -0.24989376 4.4277968 -0.21992898
C  1.59925825 3.26366838 -0.34285113
H  2.23521648 4.13677308 -0.45086051
C  2.17755921 2.01057544 -0.30480718
C  1.44177839 0.79382291 -0.15769643
H  3.25879114 1.94150786 -0.37331007
B  2.15833905 -0.63656434 -0.03765374
N  -1.51369845 -2.05646875 0.0555219
C  -2.3524121 -3.17853972 0.41065138
H  -3.15750406 -3.36884709 -0.32101201
H  -1.72892413 -4.07394576 0.46107203
H  -2.80176484 -3.02548508 1.39393126
C  -0.71051518 -2.31199753 -1.13187158
H  -0.01540374 -3.13277283 -0.94201738
H  -1.34895508 -2.57487157 -1.99203048
H  -0.11796568 -1.43987224 -1.39469601
H  1.45372804 -1.51162258 0.3803125
Cl 3.67811036 -0.52837115 1.13191007
Cl 2.79627192 -1.17872629 -1.77783573
