program: Gaussian 16
title: MeQHBCN2-H-
version: ES64L-G16RevC.01
method: RwB97XD
basis: GenECP
operation: Freq
keyword: #N
keyword: Geom=AllCheck
keyword: Guess=TCheck
keyword: SCRF=Check
keyword: GenChk
keyword: RwB97XD/GenECP
keyword: Freq
converged: YES YES YES YES
title: Mulliken charges:
elementType: C H C N N N B C H H H H C N C N
charge: -0.648489 0.242202 0.035264 0.292319 -0.152383 -0.179672 0.192716 -0.404053 0.184701 0.189136 0.194221 0.048494 -0.069905 -0.425593 -0.075061 -0.423896
chargesum: -1.00000
title: Mulliken charges with hydrogens summed into heavy atoms:
elementType: C C N N N B C C N C N
charge: -0.406286 0.035264 0.292319 -0.152383 -0.179672 0.241210 0.164005 -0.069905 -0.425593 -0.075061 -0.423896
1716.lowfreq: 0.0004 0.0006 0.0006 12.2205 17.2086 25.1866 43.3827 72.2826 91.6213
frequency: 36.6290 72.1337 90.4262 100.4441 123.7114 189.4513 262.5069 318.2350 361.0402 400.0108 409.2002 475.8510 528.8082 671.5736 679.1915 740.2693 751.3339 811.9568 824.5101 860.8140 1017.9645 1056.0327 1075.8763 1077.3777 1088.5204 1152.0402 1158.2521 1291.2613 1310.5617 1377.0922 1452.8395 1481.9144 1490.2953 1523.5759 1570.0599 2316.1852 2317.6818 2485.0016 3064.4591 3140.6756 3177.3669 3280.2654
redmass: 3.7655 5.3100 1.4031 5.5401 11.2989 3.3214 5.6800 7.2457 7.1372 3.3395 9.8654 10.0399 11.1366 4.4326 4.6215 6.5560 5.0974 3.4095 1.5518 2.4980 2.1129 2.4065 2.1440 1.9240 2.3185 1.3511 1.9103 8.8577 4.6718 6.0902 1.3181 2.1671 1.0413 1.5184 5.6202 12.7435 12.7165 1.0871 1.0340 1.1058 1.1031 1.1001
irintensity: 11.5045 1.0469 2.9576 18.1877 3.5849 1.1326 6.8495 0.0457 6.6939 3.2376 2.3500 0.3470 2.9568 2.2142 0.8913 0.6689 3.8124 18.9812 41.0810 0.7331 35.8528 48.9138 40.4151 61.7930 15.8322 3.2116 32.3522 41.9818 20.2238 9.9570 6.4621 16.3582 13.5198 17.3909 10.9075 39.9978 25.9272 151.8993 54.2491 15.8890 4.3027 0.0081
temp: 298.150 k
press: 1.00000 atm
elementType: 6 1 6 7 7 7 5 6 1 1 1 1 6 7 6 7
symmnumber: 1
zpe: 284791.4 jmol-1
zpe.correction: 0.108471 hartree
zpe.thermalcorrener: 0.118870 hartree
zpe.thermalcorrenthalpy: 0.119814 hartree
zpe.thermalcorrgfe: 0.070960 hartree
zpe.sumelectzpe: -492.107544 hartree
zpe.sumelectthermal: -492.097146 hartree
zpe.sumelectthermalent: -492.096202 hartree
zpe.sumelectthermalfe: -492.145055 hartree
dipole: -20.7768 5.7487 -8.6439
dipole: 23.2258
quadrupole: -181.1487 -52.9977 -107.6866
quadrupole: 17.4246 -38.2908 4.5495
quadrupole: -67.2044 60.9466 6.2577 17.4246 -38.2908 4.5495
hfenergy: -492.2160157 hartree
pointgroup: C01 [X(C5H5B1N5)]
dipole: -2.0320857 3.7262929 -1.4704034 debye
dipolederiv: -0.073958 -0.198013 0.0089126 0.0635291 0.1608388 0.0584343 0.016053 -0.1706861 -0.0779367 0.1145608 -0.0448025 -0.0652789 -0.0500213 0.0570983 -0.0415857 -0.0645774 -0.0360562 0.1419825 -0.1159471 -0.1001815 0.0733824 -0.1819658 -0.1130435 -0.1562266 0.0738818 -0.0798967 -0.1734061 -0.0034656 0.1378699 0.0713111 0.2073302 -0.8349491 0.1442023 0.0494194 0.1470772 -0.0335457 -0.5204682 0.1404514 -0.2683355 0.2177757 0.4178343 0.183637 -0.2640978 0.118851 -0.3944419 -0.0720043 0.2151442 0.1883307 -0.0531706 -0.5892903 -0.0481686 0.1846221 0.175048 -0.1402411 0.6649647 -0.1195104 -0.032821 -0.113255 0.6069992 -0.0786762 -0.0335968 -0.0878436 0.6917898 0.2436798 -0.1452712 -0.0408377 -0.1502503 0.6402843 -0.085269 -0.030717 -0.1265787 0.2414191 -0.0416431 -0.0979178 0.0649926 0.0106308 -0.0714953 0.0451464 0.0334339 0.0611105 0.0754534 0.02717 0.052614 -0.0814869 -0.0310583 0.0552713 -0.0421361 -0.0879159 0.0421099 0.0213987 0.0535768 0.0819255 0.0406821 0.0613769 -0.0747867 0.0135176 0.0814001 -0.0913108 -0.0523541 -0.1841581 -0.0660047 0.0147316 -0.0359356 -0.3451045 -0.0249987 0.0133114 -0.0517425 -0.1917375 0.2144504 0.058897 -0.0853417 0.0409327 -0.0552077 0.0334457 -0.1337368 0.032866 -0.0941176 -0.7831446 0.0471266 0.1140171 -0.0278163 -0.4008686 0.0038073 0.1431285 -0.0234096 -0.4364978 -0.1259152 0.0425885 -0.0280539 0.0424751 -0.0514319 0.0365424 0.0163562 0.0528871 0.2437412 -0.3976983 -0.004916 0.0257955 -0.0005774 -0.4021487 -0.0416723 0.0030353 0.0375747 -0.8215062 unknown
polarizability: 118.083138|-7.7879426|116.4021418|9.7165268|-4.4156659|113.9377309 unknown
InChI: InChI=1/C5H5BN5/c1-11-2-5(9-10-11)6(3-7)4-8/h2,6H,1H3
charge -1 multiplicity 1
16 atoms
C  3.02462413 1.80219958 0.87791976
H  3.66064592 2.49769454 1.40119873
C  3.00122755 0.42475207 0.83776452
N  2.02044633 2.20888894 0.07386545
N  1.38876442 1.15396048 -0.44984907
N  1.97149732 0.08346621 0.0036818
B  3.95232007 -0.64300016 1.57655986
C  1.57983573 3.55444428 -0.22270248
H  2.41915719 4.15362552 -0.57803998
H  0.82359527 3.48880879 -1.00281587
H  1.14744666 4.01937236 0.66515887
H  3.59533306 -1.77271887 1.33181972
C  5.46435302 -0.47910154 1.0879324
N  6.54953921 -0.35736715 0.70835604
C  3.90903657 -0.43046605 3.159162
N  3.85381232 -0.27128262 4.30284285
