program: Gaussian 16
title: cyclo_biphenylene_hydride
version: AS64L-G16RevC.02
method: RwB97XD
basis: GenECP
operation: Freq
keyword: #N
keyword: Geom=AllCheck
keyword: Guess=TCheck
keyword: SCRF=Check
keyword: GenChk
keyword: RwB97XD/GenECPFreq
converged: YES YES YES YES
title: Mulliken charges:
elementType: C C C C C C C H C H H C H C H C C H N C H H H C H H H H B C H C H C H H C H H C H H H H
charge: -0.037085 0.389958 0.435671 -0.175343 -0.483084 -0.168357 -0.450298 0.171463 -0.250213 0.208922 0.166999 -0.477215 0.178341 -0.231715 0.198964 -0.029335 -0.101011 0.157740 0.285542 -0.406374 0.150374 0.167378 0.163128 -0.456507 0.187778 0.151103 0.137412 -0.132068 -0.341759 -0.450859 0.100724 -0.243830 0.176665 -0.294958 0.145075 0.140170 -0.168680 0.106793 0.139587 -0.528860 0.117419 0.143947 0.113942 0.092453
chargesum: -1.00000
title: Mulliken charges with hydrogens summed into heavy atoms:
elementType: C C C C C C C C C C C C N C C B C C C C C
charge: -0.037085 0.389958 0.435671 -0.175343 -0.311621 -0.168357 -0.241376 -0.083215 -0.298874 -0.032751 0.128405 -0.101011 0.285542 0.074507 0.019786 -0.473826 -0.236193 0.025288 -0.009714 0.077701 -0.267494
1716.lowfreq: -6.1057 0.0004 0.0005 0.0007 11.1598 15.8265 39.9713 71.1724 79.3185
frequency: 37.6109 71.0643 78.9125 95.6861 118.8129 134.8743 157.3316 169.6468 186.8273 204.2312 247.6346 258.4468 286.0086 298.6010 309.8592 340.7371 353.5120 358.5141 374.4349 389.9264 415.4244 444.6924 465.4214 473.3512 494.4546 500.4670 567.0148 572.3014 610.3326 626.9667 645.3328 676.9716 728.9813 732.6987 740.4353 744.1576 776.4191 782.1862 785.5091 818.9522 830.1315 844.1736 861.0780 892.0109 893.5925 902.8034 915.1048 958.1714 975.8470 983.7082 991.1757 999.3344 1004.2370 1010.5943 1033.9823 1044.9108 1067.4729 1069.9056 1078.3485 1092.3593 1100.7790 1109.0463 1123.5200 1129.2493 1156.6688 1174.8034 1178.2058 1185.6057 1194.1597 1203.4866 1228.4202 1239.8508 1251.4162 1259.5849 1287.1551 1295.4339 1300.2803 1305.9346 1321.1840 1361.5806 1374.3091 1381.2478 1391.0088 1397.7891 1437.3738 1454.2498 1472.2554 1476.3835 1481.1020 1488.0851 1489.7641 1494.3983 1496.9194 1501.1199 1504.1100 1504.7457 1508.2683 1521.4632 1538.1489 1622.5379 1647.1744 1663.6691 1727.2954 2243.9633 2941.7432 2950.4333 2956.8221 2964.0878 2978.1708 2980.5099 2996.1336 3003.3000 3019.4827 3020.3878 3039.3396 3074.0642 3079.9828 3095.9475 3126.6004 3162.2980 3176.6382 3188.2587 3192.7508 3195.9505 3204.9317 3221.1640
redmass: 4.2582 3.4771 3.5286 2.9544 3.9583 3.8417 3.2741 3.0599 3.2362 3.0224 1.9708 1.7242 2.0188 1.8732 1.6569 2.9616 3.4983 2.5147 2.4307 2.7559 3.0691 3.8962 3.3998 3.3718 3.4496 2.1309 3.6164 3.7788 5.8328 3.8895 5.8724 3.2438 3.3561 2.0056 2.3912 3.3101 1.5404 3.5033 1.4842 2.9389 2.1781 2.3134 2.0998 1.5171 1.7825 1.8824 1.4578 1.5940 1.2870 2.5304 1.3805 3.7787 4.5766 1.3712 1.7144 2.3579 2.3270 1.3544 1.6231 1.4143 1.7005 1.5870 1.8227 1.3224 2.4500 1.5187 1.6048 1.5297 1.7513 2.0743 2.4938 1.5059 1.6563 1.4986 1.3169 2.3487 3.5181 1.3046 1.2781 1.3639 1.5402 1.5161 2.7291 2.4479 2.4553 1.2133 1.1876 1.1145 1.1476 1.1297 1.1216 1.1297 1.7464 1.1860 1.6075 1.3653 1.2001 1.3630 1.7548 8.5770 8.8319 6.6191 8.1389 1.0821 1.0591 1.0720 1.0586 1.0636 1.0647 1.0641 1.0722 1.0860 1.0947 1.0975 1.1006 1.0853 1.0734 1.0828 1.1037 1.0859 1.0874 1.0903 1.0956 1.0956 1.0942 1.0917
irintensity: 0.1738 1.1229 1.6714 1.7768 4.5196 0.2689 2.2744 3.3436 1.1008 0.2597 1.9557 1.3070 0.7198 10.0379 0.3404 1.6714 4.8018 0.7190 0.8541 0.9046 0.6533 0.3308 1.1487 1.2631 2.3531 1.5611 2.2128 7.2041 0.8310 3.9244 3.6583 0.9888 4.2485 8.3607 11.1288 18.9219 1.6836 5.5514 114.0703 3.8945 0.1646 1.1638 6.2951 3.4172 10.6316 6.3972 0.7458 3.2861 1.1387 12.3873 30.5754 46.4215 16.6660 8.1898 5.8823 12.1641 15.9748 0.2533 14.0047 13.6041 33.0862 1.5244 16.1163 7.3311 50.7532 34.8202 21.9572 27.0021 26.1279 4.0639 11.5550 3.9822 20.0978 12.3783 7.1826 11.3081 12.5595 4.3715 0.4767 0.9981 1.1856 0.7823 134.2157 19.4475 27.3202 2.3844 15.3503 0.1891 23.9013 11.4346 11.1378 10.3561 2.9944 25.8722 12.7288 8.8493 14.6087 0.7105 127.2710 12.2413 83.2484 45.4995 91.1835 514.9503 163.6139 86.8832 209.0507 112.5610 37.0034 160.7882 129.8987 97.8071 221.9342 32.7624 182.0743 42.8277 47.0179 43.5650 28.2677 13.8947 16.4248 31.3373 5.4843 67.4906 33.3716 26.0623
temp: 298.150 k
press: 1.00000 atm
elementType: 6 6 6 6 6 6 6 1 6 1 1 6 1 6 1 6 6 1 7 6 1 1 1 6 1 1 1 1 5 6 1 6 1 6 1 1 6 1 1 6 1 1 1 1
symmnumber: 1
zpe: 988811.8 jmol-1
zpe.correction: 0.376619 hartree
zpe.thermalcorrener: 0.394778 hartree
zpe.thermalcorrenthalpy: 0.395722 hartree
zpe.thermalcorrgfe: 0.331775 hartree
zpe.sumelectzpe: -817.068041 hartree
zpe.sumelectthermal: -817.049882 hartree
zpe.sumelectthermalent: -817.048937 hartree
zpe.sumelectthermalfe: -817.112885 hartree
dipole: 6.8505 -0.4559 -2.8103
dipole: 7.4185
quadrupole: -162.3293 -134.3800 -146.6450
quadrupole: -6.8197 3.3201 0.2188
quadrupole: -14.5446 13.4048 1.1398 -6.8197 3.3201 0.2188
hfenergy: -817.4446598 hartree
pointgroup: C01 [X(C19H23B1N1)]
dipole: 2.656268 -0.2246806 -1.1398878 debye
polarizability: 347.6608779|-19.8459241|338.8527319|-54.583572|10.3396161|227.033009 unknown
InChI: InChI=1/C19H23BN/c1-21(2)17-11-7-9-15-14-8-6-10-16(18(14)19(15)17)20-12-4-3-5-13-20/h6-11,20H,3-5,12-13H2,1-2H3
charge -1 multiplicity 1
44 atoms
C  0.28094306 0.88946343 0.41370905
C  0.96495864 2.10701045 0.16536372
C  2.12301665 1.36685441 -0.42782981
C  1.49037746 0.1323546 -0.1573716
C  3.33289908 1.49580789 -1.05516264
C  2.11559824 -1.06968881 -0.45610745
C  3.95079885 0.28016205 -1.41113999
H  3.79328637 2.45258551 -1.27191466
C  3.37547503 -0.94167321 -1.11505868
H  4.91269216 0.29300988 -1.9140594
H  3.92106584 -1.83634947 -1.38735645
C  0.44840465 3.33664023 0.45722798
H  0.96662831 4.26935534 0.2627706
C  -0.84124075 3.30506507 1.03444802
H  -1.32587782 4.23777014 1.30967085
C  -1.50986093 2.11037902 1.23950454
C  -1.00720993 0.80798738 0.91834663
H  -2.50587145 2.17003721 1.66751057
N  1.57399486 -2.32050189 -0.14963405
C  2.25696804 -3.49928812 -0.62796715
H  3.22408698 -3.67843947 -0.12512587
H  1.6182251 -4.36594388 -0.44374852
H  2.43035294 -3.43620764 -1.70437103
C  1.04819763 -2.47695842 1.19695055
H  0.34505909 -3.31305018 1.21991619
H  1.85686158 -2.66847808 1.92281372
H  0.49564172 -1.59281245 1.5025367
H  -1.49941625 -1.15326922 2.10105276
B  -1.92557748 -0.54160437 1.10773231
C  -3.51925235 -0.20142148 1.35243205
H  -3.69304061 0.4821542 2.19758737
C  -1.82915478 -1.48685393 -0.23898463
H  -0.79578369 -1.68583037 -0.5453568
C  -2.58437179 -0.87254743 -1.42640877
H  -2.1070102 0.07901193 -1.7023691
H  -2.52806611 -1.51331891 -2.31909431
C  -4.21984215 0.34293678 0.09772425
H  -3.7874543 1.31591895 -0.17508959
H  -5.29161268 0.52159183 0.27281581
C  -4.05502146 -0.59994452 -1.09779222
H  -4.54638016 -1.55663898 -0.86554263
H  -4.57088403 -0.18811032 -1.97595779
H  -4.02681486 -1.13776922 1.63736112
H  -2.27459648 -2.47437891 -0.02594463
