program: Gaussian 16
title: MeQHBCCH-H-
version: ES64L-G16RevC.01
method: RwB97XD
basis: GenECP
operation: Freq
keyword: #N
keyword: Geom=AllCheck
keyword: Guess=TCheck
keyword: SCRF=Check
keyword: GenChk
keyword: RwB97XD/GenECP
keyword: Freq
converged: YES YES NO YES
title: Mulliken charges:
elementType: C H C N N N B C H H H H C C H C C H
charge: -0.449433 0.221188 -0.300927 0.276323 -0.067554 -0.254681 -0.016457 -0.374926 0.183118 0.185912 0.179078 -0.050684 -0.218800 -0.245198 0.243140 -0.011035 -0.534808 0.235744
chargesum: -1.00000
title: Mulliken charges with hydrogens summed into heavy atoms:
elementType: C C N N N B C C C C C
charge: -0.228245 -0.300927 0.276323 -0.067554 -0.254681 -0.067141 0.173182 -0.218800 -0.002058 -0.011035 -0.299064
1716.lowfreq: -33.1005 -12.9800 0.0002 0.0004 0.0005 37.5949 45.9759 87.1717 95.1670
frequency: 36.7094 85.9759 94.6780 105.6214 131.7757 188.7644 249.9983 291.0723 346.0947 385.2076 398.6976 460.7085 507.0279 634.5759 639.4720 642.0635 661.6755 670.8375 678.2778 725.9718 757.8282 812.7605 818.7293 863.8425 1024.5273 1061.0020 1074.9984 1086.0496 1093.0729 1152.5847 1158.9507 1279.4326 1314.9334 1373.0233 1453.3606 1476.3923 1491.3672 1521.5927 1567.2155 2139.3292 2142.7711 2389.2766 3058.9820 3130.5728 3175.5018 3281.5004 3463.5400 3464.0627
redmass: 4.4251 2.6170 1.8220 2.8743 3.8385 2.9637 4.2130 4.6971 3.4929 5.0071 3.9974 5.1621 4.8063 3.6883 1.3663 1.4066 1.3691 1.4045 5.1461 5.1056 3.4070 2.5704 2.0492 2.5110 2.5221 2.4616 2.3237 2.1441 1.6281 1.3227 1.8827 9.5835 4.9243 5.6650 1.3875 2.4362 1.0402 1.3441 5.6903 5.9717 5.9184 1.0853 1.0345 1.1058 1.1015 1.0994 1.1563 1.1570
irintensity: 8.8191 0.5493 0.9831 4.2209 2.6762 0.6234 3.5749 5.5961 0.8869 2.9904 15.4470 4.4576 18.8347 2.7385 16.9484 139.6861 61.8695 79.0323 8.3117 1.7456 17.7274 11.6887 36.7137 7.6093 34.0416 84.1201 15.7202 62.2818 88.6834 1.6334 46.4528 51.8265 20.7823 18.3055 10.8812 18.6130 11.9513 19.1585 11.0624 42.3174 26.3073 266.2947 70.1778 20.5346 6.3939 0.1885 74.1810 35.6909
temp: 298.150 k
press: 1.00000 atm
elementType: 6 1 6 7 7 7 5 6 1 1 1 1 6 6 1 6 6 1
symmnumber: 1
zpe: 338318.3 jmol-1
zpe.correction: 0.128859 hartree
zpe.thermalcorrener: 0.139869 hartree
zpe.thermalcorrenthalpy: 0.140813 hartree
zpe.thermalcorrgfe: 0.091323 hartree
zpe.sumelectzpe: -459.852257 hartree
zpe.sumelectthermal: -459.841247 hartree
zpe.sumelectthermalent: -459.840303 hartree
zpe.sumelectthermalfe: -459.889793 hartree
dipole: -16.0818 5.0988 -9.6797
dipole: 19.4504
quadrupole: -141.1821 -61.5498 -88.3127
quadrupole: 18.5463 -35.2568 2.5248
quadrupole: -44.1672 35.4651 8.7021 18.5463 -35.2568 2.5248
hfenergy: -459.9811155 hartree
pointgroup: C01 [X(C7H7B1N3)]
dipole: -0.2758755 3.544211 -1.5585597 debye
dipolederiv: -0.0802495 -0.2345268 0.0936892 0.1269076 0.1017193 -0.1009633 -0.0636645 -0.1041216 -0.0733734 0.0514958 -0.0683625 0.0198231 -0.0860717 0.085528 0.0452677 0.0262011 0.0448756 0.1716937 -0.1876999 -0.1966474 0.1576049 -0.2984808 -0.0166832 -0.0586164 0.1952714 -0.0584627 -0.1348826 0.1215446 0.0820976 -0.0531842 0.107979 -0.7977596 0.378764 -0.0277223 0.3100917 -0.2376392 -0.6863924 0.292187 -0.1851327 0.3592709 0.3035447 -0.1747734 -0.2108157 -0.2108688 -0.1541032 0.0431092 0.2407989 -0.0846152 -0.1195631 -0.5636589 0.1139175 0.0737369 0.1425999 -0.3308642 0.7329646 -0.0578012 -0.0429677 -0.0163348 0.5994896 -0.0897322 -0.0609448 -0.0963629 0.715472 0.1688193 -0.1087596 0.04327 -0.0885681 0.6361677 -0.1904706 0.0350432 -0.1610296 0.3863011 0.0572545 -0.0073934 0.0960215 0.0470293 -0.0307869 0.0158923 0.0408481 0.1126781 -0.1243899 -0.0712852 0.0818275 -0.0453858 -0.0302897 0.0610374 0.0235054 0.0099734 0.0257517 0.0907303 0.0670823 -0.0713052 -0.049883 -0.0009961 -0.1342374 0.0192794 -0.0566431 -0.0853674 -0.0075754 -0.238901 -0.0454802 -0.014104 -0.0347224 -0.4461541 -0.1009968 -0.008709 -0.0956672 -0.2947301 -0.3413573 0.0543391 -0.0792675 0.0371526 -0.2346458 -0.0531086 -0.0530431 -0.0490024 0.3231525 -0.4229329 -0.0143133 0.060401 -0.0066273 -0.4655784 0.089508 0.0686499 0.1745362 -0.9895327 0.2800577 -0.0082611 0.0228318 -0.0059198 0.2823455 0.0128362 0.0186356 0.0173284 0.1331804 0.2792734 0.1746059 -0.1360253 0.183373 -0.1910621 0.0161418 -0.1436295 0.0065383 -0.2823708 -0.9279965 -0.0732942 0.1649302 -0.1393939 -0.4620883 0.0465506 0.1326476 0.019278 -0.46913 0.1552131 -0.0397111 0.0319936 -0.0347447 0.2728222 0.0069983 0.0241649 0.0072047 0.2780613 unknown
polarizability: 148.0039794|0.0088597|128.4066903|-3.1767061|-24.3806261|131.7599303 unknown
InChI: InChI=1/C7H7BN3/c1-4-8(5-2)7-6-11(3)10-9-7/h1-2,6,8H,3H3
charge -1 multiplicity 1
18 atoms
C  3.19327613 1.74590686 0.47271899
H  4.11141751 2.28442135 0.30344395
C  2.94843972 0.50326997 1.01507389
N  1.98389351 2.25337633 0.14090667
N  1.01800512 1.38312268 0.45143005
N  1.58756148 0.33606879 0.97244394
B  3.98969194 -0.59232281 1.59510384
C  1.66591423 3.5185331 -0.479894
H  2.09229757 3.57080977 -1.4838828
H  0.5812466 3.59135651 -0.54391733
H  2.05016982 4.34432882 0.12169465
H  3.77932658 -1.6701845 1.05711614
C  3.81343324 -0.77667757 3.16882974
C  3.66558103 -0.92424656 4.36234632
H  3.53134925 -1.05261102 5.41055274
C  5.48426142 -0.14835515 1.2589442
C  6.61658408 0.19140649 0.99067332
H  7.61666926 0.4751295 0.76164482
