program: Gaussian 16
title: MeQClBF2-H-
version: ES64L-G16RevC.01
method: RwB97XD
basis: GenECP
operation: Freq
keyword: #N
keyword: Geom=AllCheck
keyword: Guess=TCheck
keyword: SCRF=Check
keyword: GenChk
keyword: RwB97XD/GenECP
keyword: Freq
converged: YES YES YES YES
title: Mulliken charges:
elementType: C C N N N B H C H H H Cl F F
charge: -0.222540 -0.731358 0.328164 -0.112063 -0.174339 0.334587 -0.168819 -0.441438 0.201339 0.181097 0.195021 0.301305 -0.347938 -0.343017
chargesum: -1.00000
title: Mulliken charges with hydrogens summed into heavy atoms:
elementType: C C N N N B C Cl F F
charge: -0.222540 -0.731358 0.328164 -0.112063 -0.174339 0.165767 0.136019 0.301305 -0.347938 -0.343017
1716.lowfreq: -23.8897 -0.0026 -0.0015 0.0010 20.7536 31.8826 88.5198 103.6403 129.8555
frequency: 84.6203 98.3231 129.7930 143.8829 194.8718 233.4893 245.7525 291.1591 400.6512 437.7809 482.1811 529.5595 661.0531 666.7581 738.0857 800.8088 865.3590 899.3747 1051.6755 1065.5597 1138.5508 1153.9840 1156.2534 1186.0432 1285.0850 1298.0028 1370.2590 1449.3189 1487.4835 1493.1361 1526.0468 1541.7815 2399.2418 3065.4868 3140.8118 3180.2359
redmass: 6.5135 6.8159 1.1630 15.1864 4.5642 4.2369 7.5495 13.1583 10.5044 6.5613 7.2147 11.9563 4.6080 10.9024 12.5670 5.6982 5.5479 6.4579 2.1562 3.5776 2.0434 1.3601 2.9365 1.3453 4.4622 13.0322 5.9776 1.3488 1.0385 1.7381 1.8923 9.3853 1.0812 1.0336 1.1060 1.1034
irintensity: 0.1922 2.1713 0.0303 5.3265 2.7756 3.4003 0.3973 6.1174 1.5995 9.6952 1.6541 1.8792 21.0025 1.6208 6.2270 67.7076 214.2585 135.3570 10.2703 53.4551 92.5660 6.8217 117.4839 159.1276 67.6660 131.9789 14.1768 1.6324 15.0937 0.7892 37.8514 72.1898 516.2562 42.3936 14.5610 4.0120
temp: 298.150 k
press: 1.00000 atm
elementType: 6 6 7 7 7 5 1 6 1 1 1 17 9 9
symmnumber: 1
zpe: 226647.2 jmol-1
zpe.correction: 0.086325 hartree
zpe.thermalcorrener: 0.095763 hartree
zpe.thermalcorrenthalpy: 0.096707 hartree
zpe.thermalcorrgfe: 0.050775 hartree
zpe.sumelectzpe: -965.809373 hartree
zpe.sumelectthermal: -965.799936 hartree
zpe.sumelectthermalent: -965.798991 hartree
zpe.sumelectthermalfe: -965.844923 hartree
dipole: -18.8359 4.8469 -6.6378
dipole: 20.5510
quadrupole: -147.1491 -59.6827 -89.6784
quadrupole: 11.9948 -31.4820 3.8446
quadrupole: -48.3124 39.1540 9.1584 11.9948 -31.4820 3.8446
hfenergy: -965.8956982 hartree
pointgroup: C01 [X(C3H4B1Cl1F2N3)]
dipole: -1.6437808 4.3090961 -0.5650509 debye
dipolederiv: 0.1500306 -0.0322244 0.2047416 0.2098794 0.6757005 0.5897966 0.3097461 0.2545671 0.544457 -0.1861501 -0.0215027 -0.1233502 0.0183537 -0.4227007 -0.103162 -0.0974412 -0.1857914 -0.3175043 -0.0719032 0.2734757 0.0711877 0.2412602 -0.912617 -0.0244056 0.0609178 0.0110121 0.0447409 -0.4026636 -0.0496986 -0.2973901 0.0057171 0.334742 0.2348819 -0.2760165 0.1536297 -0.5337984 -0.1852254 0.1792028 0.2266239 -0.0489196 -0.5535554 -0.1771783 0.1352894 0.1513316 -0.0420968 1.6077582 -0.1737987 0.003292 -0.0609304 1.5529452 -0.0885844 0.0521916 -0.2474429 1.5126133 -0.2328188 0.0650443 -0.004724 0.057939 -0.6134066 -0.1089258 -0.0079893 -0.1065174 -0.2725281 0.2945057 -0.1473151 -0.023076 -0.1520889 0.5816975 -0.0921042 -0.0289129 -0.0772815 0.197511 -0.0430872 -0.0951697 0.0361107 0.010425 -0.0951546 0.0357158 0.0155825 0.0232377 0.0982349 0.0462078 0.0433261 -0.0693181 -0.0225465 0.0664823 -0.0444541 -0.0935807 0.0425303 0.0038397 0.0361991 0.0727027 0.0574754 0.0465955 -0.033458 0.0295856 0.1108684 -0.061958 -0.0309029 -0.101677 -0.1017924 -0.1613559 -0.1555308 -0.3189443 -0.3327554 -0.1863956 -0.2785736 -0.4049701 -1.3024871 -0.0416677 -0.1148386 -0.1999923 -0.6453228 0.0122238 -0.1753006 0.0546713 -0.5381941 -0.6086888 0.0294177 0.1946217 0.0498385 -0.616408 0.069366 0.181041 0.266585 -1.261402 unknown
polarizability: 82.2784183|-7.2280122|112.8430855|18.2486932|9.0102108|97.1433089 unknown
InChI: InChI=1/C3H4BClF2N3/c1-10-3(5)2(4(6)7)8-9-10/h4H,1H3
charge -1 multiplicity 1
14 atoms
C  2.86694479 1.76708656 1.00633926
C  3.09389054 0.4308319 0.76204511
N  2.04452703 2.2225986 0.03538013
N  1.75398209 1.21816152 -0.80022177
N  2.37486279 0.15774189 -0.37003327
B  3.97557306 -0.65975754 1.58295549
H  3.96080163 -1.754755 1.03417135
C  1.50564452 3.5479668 -0.16781716
H  2.31077544 4.26468494 -0.33851145
H  0.86212186 3.50173213 -1.0441258
H  0.92296966 3.85752276 0.70123078
Cl 3.42727046 2.81025897 2.25332559
F  5.33792112 -0.18031646 1.69886385
F  3.44853081 -0.7644117 2.92896304
