program: Gaussian 16
title: MeQMeBF2-H-
version: ES64L-G16RevC.01
method: RwB97XD
basis: GenECP
operation: Freq
keyword: #N
keyword: Geom=AllCheck
keyword: Guess=TCheck
keyword: SCRF=Check
keyword: GenChk
keyword: RwB97XD/GenECPFreq
converged: YES YES NO NO
title: Mulliken charges:
elementType: C C N N N B H C H H H F F C H H H
charge: 0.056427 -0.462922 0.273716 -0.144528 -0.199637 0.335648 -0.170282 -0.374486 0.182400 0.191412 0.179912 -0.370384 -0.349872 -0.667841 0.210380 0.149038 0.161018
chargesum: -1.00000
title: Mulliken charges with hydrogens summed into heavy atoms:
elementType: C C N N N B C F F C
charge: 0.056427 -0.462922 0.273716 -0.144528 -0.199637 0.165366 0.179239 -0.370384 -0.349872 -0.147405
1716.lowfreq: -24.4312 -0.0006 0.0005 0.0007 16.2632 42.0713 54.4142 102.9379 112.4487
frequency: 33.6583 102.8965 112.3046 131.4107 160.2007 205.3412 262.0605 269.9794 302.8321 410.5547 446.5900 484.0198 656.6610 686.7548 698.9982 762.2062 792.9949 844.9173 888.0010 992.3236 1050.0276 1073.7951 1085.4877 1128.4359 1152.8325 1158.2957 1222.8136 1289.2199 1317.8849 1385.4931 1416.3835 1449.8482 1469.9497 1486.2741 1500.2486 1505.0340 1540.4093 1599.6148 2365.6430 3033.1422 3052.8082 3088.7257 3121.6391 3161.6720 3170.3778
redmass: 5.7987 4.5129 1.0695 4.9118 1.0916 4.8128 2.6126 3.6096 10.2577 7.2052 4.4992 7.0202 4.8423 6.2223 4.0034 10.0243 3.9460 5.4264 5.8494 2.0529 2.0047 1.4586 1.4405 1.3406 1.3214 2.8376 5.2595 4.5596 8.4259 5.7189 1.3573 1.2573 1.2222 1.0416 1.0450 1.1279 3.4601 7.5176 1.0813 1.0400 1.0345 1.1012 1.1054 1.0977 1.1024
irintensity: 3.3789 1.2929 0.1884 9.3773 0.7026 0.9912 2.5733 0.2326 4.4234 1.6075 4.1454 0.2886 10.7144 2.7088 7.8364 9.2442 58.5781 202.5960 152.3777 10.0625 26.5028 0.5946 178.5065 119.1000 0.4132 97.6571 13.6506 44.6443 74.9763 5.9727 7.0651 1.7601 33.3655 3.9269 22.6936 6.2162 43.2018 14.1538 535.9426 56.5760 58.6212 30.5043 20.9358 1.9956 5.5971
temp: 298.150 k
press: 1.00000 atm
elementType: 6 6 7 7 7 5 1 6 1 1 1 9 9 6 1 1 1
symmnumber: 1
zpe: 323415.0 jmol-1
zpe.correction: 0.123182 hartree
zpe.thermalcorrener: 0.133254 hartree
zpe.thermalcorrenthalpy: 0.134198 hartree
zpe.thermalcorrgfe: 0.086780 hartree
zpe.sumelectzpe: -545.488187 hartree
zpe.sumelectthermal: -545.478115 hartree
zpe.sumelectthermalent: -545.477171 hartree
zpe.sumelectthermalfe: -545.524590 hartree
dipole: -17.2853 6.0314 -5.6601
dipole: 19.1624
quadrupole: -132.4795 -51.7426 -83.3403
quadrupole: 17.0630 -27.7422 8.3189
quadrupole: -43.2921 37.4449 5.8472 17.0630 -27.7422 8.3189
hfenergy: -545.6113691 hartree
pointgroup: C01 [X(C4H7B1F2N3)]
dipole: -1.2066842 4.4551962 -0.3805085 debye
dipolederiv: 0.0130195 -0.1720894 0.0223062 0.096208 0.3299147 0.2686276 0.1096459 -0.106983 0.0889724 -0.2276381 0.0320775 -0.0898802 -0.0280182 -0.4154736 -0.1300631 -0.0747497 -0.1072066 -0.315384 -0.0680378 0.2188345 0.0755627 0.2233674 -0.8796283 0.0468393 0.0800632 0.035159 0.0475784 -0.4334081 -0.0189167 -0.3056061 0.073917 0.3632626 0.3047364 -0.2789949 0.1712154 -0.5689212 -0.1578412 0.1650669 0.2601759 -0.0782455 -0.5715793 -0.1990339 0.1818503 0.1471137 0.0159097 1.547643 -0.1029692 0.0190319 -0.0511145 1.5642866 -0.1198138 0.0508755 -0.228265 1.5296417 -0.2377859 0.0927824 0.0084981 0.1009911 -0.6135625 -0.1058838 0.0079981 -0.1069128 -0.2814707 0.2890403 -0.1397374 -0.0405938 -0.1213671 0.6092841 -0.0739098 -0.0371949 -0.0891583 0.2039918 -0.0634233 -0.1175106 0.0368502 -0.0043231 -0.1134684 0.0345651 0.0129128 0.0256385 0.092574 0.0478482 0.0474195 -0.0698506 -0.0207311 0.0633493 -0.0426483 -0.0932594 0.0542859 -0.0068378 0.0221974 0.0871915 0.0702423 0.0504387 -0.0561976 0.0152654 0.1183167 -0.0834011 -0.0458781 -1.226533 -0.0905223 -0.2035607 -0.2220043 -0.6990091 -0.0232822 -0.2485874 0.0082523 -0.5884236 -0.6458316 -0.0093397 0.2482917 0.0300743 -0.6394202 0.1364607 0.2328107 0.2992533 -1.2386434 0.1333518 0.0530942 -0.0729579 0.0044335 0.082731 -0.0492376 -0.1017534 0.0181792 0.0754967 0.0508428 0.0008193 -0.0673177 0.04671 0.0837836 0.0600337 -0.0513027 0.0098715 0.0245374 0.0187948 -0.1284758 0.0039594 -0.1201953 -0.1064896 -0.0148168 0.0515011 0.0642088 -0.0040955 -0.062239 0.0822753 0.1048488 0.019859 -0.0017832 -0.1078389 0.0398679 -0.1112507 -0.0290477 unknown
polarizability: 84.1095648|-7.9437375|114.8616222|15.5840361|3.6761194|96.0805077 unknown
InChI: InChI=1/C4H7BF2N3/c1-3-4(5(6)7)8-9-10(3)2/h5H,1-2H3
charge -1 multiplicity 1
17 atoms
C  2.863848 1.77698591 1.01383804
C  3.02067239 0.42251393 0.78217173
N  2.06889328 2.22096169 0.01189505
N  1.73613124 1.21435144 -0.81076932
N  2.30453553 0.13900328 -0.34948608
B  3.86664139 -0.64960889 1.65026943
H  3.99378001 -1.7297367 1.0847815
C  1.59951814 3.56306414 -0.23465283
H  2.44136649 4.24053434 -0.39649985
H  0.9786208 3.53783312 -1.12837472
H  1.00711585 3.92333175 0.60958291
F  5.17991467 -0.08276295 1.93810978
F  3.22272163 -0.84302707 2.94110151
C  3.39277591 2.6647704 2.08595765
H  4.04034338 2.07985039 2.73771468
H  3.97957266 3.49178233 1.67228821
H  2.58569263 3.09347988 2.68947133
