program: Gaussian 16
title: MeQFBF2-H-
version: ES64L-G16RevC.01
method: RwB97XD
basis: GenECP
operation: Freq
keyword: #N
keyword: Geom=AllCheck
keyword: Guess=TCheck
keyword: SCRF=Check
keyword: GenChk
keyword: RwB97XD/GenECPFreq
converged: YES YES NO NO
title: Mulliken charges:
elementType: C C N N N B H C H H H F F F
charge: -0.114209 -0.188579 0.195813 -0.211859 -0.179506 0.362619 -0.162020 -0.406292 0.193880 0.191646 0.191594 -0.358002 -0.353390 -0.161694
chargesum: -1.00000
title: Mulliken charges with hydrogens summed into heavy atoms:
elementType: C C N N N B C F F F
charge: -0.114209 -0.188579 0.195813 -0.211859 -0.179506 0.200599 0.170828 -0.358002 -0.353390 -0.161694
1716.lowfreq: -22.3605 -0.0009 -0.0007 -0.0007 12.0146 21.1529 80.7239 87.8695 94.4368
frequency: 74.8780 83.8099 88.2120 131.9420 190.5842 263.0388 303.5658 308.2739 413.8678 472.9535 503.7728 655.6833 678.8590 713.6646 738.9838 816.2420 864.1714 901.6435 1050.6371 1077.2496 1143.8793 1155.1456 1201.6638 1232.3187 1285.0831 1323.3932 1375.6777 1450.6298 1487.6655 1507.2890 1569.6242 1611.1227 2402.1177 3063.9824 3140.7023 3174.5970
redmass: 7.9882 1.9743 1.7826 9.2791 4.6515 3.9660 13.2201 10.4379 11.3642 10.0815 5.9673 5.3558 11.3330 7.7667 12.4312 6.4925 5.5404 6.3937 1.9390 4.2264 1.5424 1.3096 1.3543 8.1859 4.1347 8.7669 7.1470 1.2702 1.0371 1.1058 6.5870 9.8014 1.0813 1.0331 1.1063 1.1042
irintensity: 0.2850 1.2121 1.0344 5.2725 2.5726 2.1783 6.8973 2.0628 4.5773 8.1276 13.8597 16.1821 0.0601 23.6648 3.2396 56.2353 225.0860 149.4606 21.4213 42.6111 175.8367 0.2833 153.1550 7.3988 77.9389 151.1417 57.2250 2.2428 13.3797 0.8422 103.1114 199.7005 487.9225 49.9710 16.0134 3.8492
temp: 298.150 k
press: 1.00000 atm
elementType: 6 6 7 7 7 5 1 6 1 1 1 9 9 9
symmnumber: 1
zpe: 230023.5 jmol-1
zpe.correction: 0.087611 hartree
zpe.thermalcorrener: 0.096889 hartree
zpe.thermalcorrenthalpy: 0.097834 hartree
zpe.thermalcorrgfe: 0.052160 hartree
zpe.sumelectzpe: -605.438059 hartree
zpe.sumelectthermal: -605.428781 hartree
zpe.sumelectthermalent: -605.427837 hartree
zpe.sumelectthermalfe: -605.473510 hartree
dipole: -18.8543 5.0271 -6.6564
dipole: 20.6171
quadrupole: -139.5202 -51.2566 -82.8386
quadrupole: 12.0712 -32.4040 3.5191
quadrupole: -48.3150 39.9486 8.3665 12.0712 -32.4040 3.5191
hfenergy: -605.5256702 hartree
pointgroup: C01 [X(C3H4B1F3N3)]
dipole: -1.764008 4.0172323 -0.8789792 debye
dipolederiv: 0.3592664 -0.0342103 0.2913402 0.2169843 1.0387582 0.6747508 0.3959715 0.3186624 0.8236395 -0.2392679 0.061282 -0.1158778 -0.0072692 -0.4917597 -0.1502989 -0.1315294 -0.0798756 -0.3536401 -0.1204653 0.2180476 0.0041312 0.3039251 -0.9508916 0.0624769 0.0413727 -0.0581328 -0.0284471 -0.4152593 0.0248606 -0.2596871 0.0739247 0.3791544 0.3490693 -0.2428163 0.276474 -0.4490694 -0.1368359 0.1622343 0.3144475 -0.0645682 -0.530977 -0.1776756 0.2249378 0.1429981 0.0593542 1.6612852 -0.1215064 0.0606159 -0.0686471 1.5066593 -0.1444017 0.0868107 -0.2237877 1.6071006 -0.2389893 0.056777 -0.0132232 0.0676003 -0.5971431 -0.0939992 -0.0102652 -0.1066037 -0.280898 0.2994154 -0.1638062 -0.0486006 -0.1374384 0.6455555 -0.0518329 -0.0409465 -0.08382 0.1973756 -0.0432591 -0.0999083 0.0340817 0.0052335 -0.1072037 0.0282271 0.015384 0.0311113 0.0940807 0.0473893 0.0466423 -0.0641521 -0.0190076 0.0576959 -0.0427156 -0.0882022 0.0435739 0.0089758 0.0288166 0.0864511 0.0630221 0.0457596 -0.0418606 0.0208382 0.107664 -0.067938 -0.0368189 -1.3139712 -0.0835294 -0.1521774 -0.2321933 -0.6434724 0.0054187 -0.1943222 0.0438111 -0.5681476 -0.6228712 0.0250612 0.1936746 0.0502214 -0.5962211 0.0839439 0.1653559 0.2455308 -1.3147065 -0.2652537 -0.1783956 -0.307595 -0.2345252 -0.668294 -0.563801 -0.3294149 -0.4820038 -0.7587988 unknown
polarizability: 72.9310048|-10.6706465|98.0360773|13.6572422|0.6579443|79.7548551 unknown
InChI: InChI=1/C3H4BF3N3/c1-10-3(5)2(4(6)7)8-9-10/h4H,1H3
charge -1 multiplicity 1
14 atoms
C  2.86072924 1.75158072 0.98712617
C  3.08838145 0.42010172 0.75784254
N  2.04177197 2.21848266 0.02828637
N  1.74262984 1.20898112 -0.80791909
N  2.36219713 0.14992151 -0.37319482
B  3.97714184 -0.6547612 1.58880289
H  3.98331332 -1.75107297 1.04238604
C  1.51499107 3.55095371 -0.1559015
H  2.32509573 4.26283111 -0.32251528
H  0.86752419 3.52218183 -1.03028729
H  0.93689842 3.85491452 0.71814619
F  5.32959814 -0.14957333 1.71675117
F  3.44383353 -0.7679598 2.93232492
F  3.29126916 2.57853536 1.93267656
