program: Gaussian 16
title: MeIM + H-
version: ES64L-G16RevC.01
method: RwB97XD
basis: GenECP
operation: Freq
keyword: #N
keyword: Geom=AllCheck
keyword: Guess=TCheck
keyword: SCRF=Check
keyword: GenChk
keyword: RwB97XD/GenECPFreq
converged: YES YES NO NO
title: Mulliken charges:
elementType: C H C N N N B F F H C H H H
charge: -0.356120 0.206143 -0.394651 0.257578 -0.145573 -0.227607 0.368888 -0.378195 -0.333775 -0.149351 -0.398847 0.182463 0.185492 0.183554
chargesum: -1.00000
title: Mulliken charges with hydrogens summed into heavy atoms:
elementType: C C N N N B F F C
charge: -0.149977 -0.394651 0.257578 -0.145573 -0.227607 0.219537 -0.378195 -0.333775 0.152662
1716.lowfreq: -27.1523 0.0001 0.0004 0.0004 6.4582 28.8730 67.5789 75.9211 109.3447
frequency: 65.4929 73.0995 108.5175 141.1985 217.0652 314.9963 341.8520 425.1926 478.6389 630.6311 674.4155 730.0270 772.3885 830.1359 860.8167 892.6143 1033.0123 1055.3308 1074.6808 1086.7002 1108.8104 1151.9116 1161.9819 1283.0633 1306.4021 1376.5313 1448.4079 1478.0446 1489.1972 1520.2965 1568.1296 2340.8695 3057.6070 3131.8571 3165.7283 3288.8055
redmass: 7.3477 1.0893 6.2313 4.7114 4.4141 8.4133 4.7530 5.1147 9.9860 3.9494 6.1533 4.6789 2.8002 1.7979 5.0011 6.0284 3.5684 2.0305 2.7078 1.2914 1.5401 1.3152 2.0162 9.7958 4.8746 5.6194 1.3230 2.7025 1.0394 1.3576 5.7414 1.0788 1.0334 1.1060 1.1039 1.0993
irintensity: 6.4101 0.4270 1.4657 5.1517 2.1082 4.3022 2.5189 10.8693 0.4536 5.1394 5.5952 0.6339 45.6089 62.4907 186.1441 152.9486 7.1414 58.5821 38.6131 146.4506 105.6465 0.2349 193.1642 67.1307 26.6400 0.8667 6.4142 15.4418 12.2193 14.2285 24.8470 546.7789 64.8622 21.4249 5.9005 0.2170
temp: 298.150 k
press: 1.00000 atm
elementType: 6 1 6 7 7 7 5 9 9 1 6 1 1 1
symmnumber: 1
zpe: 249328.4 jmol-1
zpe.correction: 0.094964 hartree
zpe.thermalcorrener: 0.103476 hartree
zpe.thermalcorrenthalpy: 0.104420 hartree
zpe.thermalcorrgfe: 0.060469 hartree
zpe.sumelectzpe: -506.196915 hartree
zpe.sumelectthermal: -506.188403 hartree
zpe.sumelectthermalent: -506.187459 hartree
zpe.sumelectthermalfe: -506.231411 hartree
dipole: -17.1275 6.5566 -5.8025
dipole: 19.2356
quadrupole: -122.5980 -47.3054 -76.3886
quadrupole: 17.4434 -28.3661 8.6776
quadrupole: -40.5007 34.7919 5.7087 17.4434 -28.3661 8.6776
hfenergy: -506.2918795 hartree
pointgroup: C01 [X(C3H5B1F2N3)]
dipole: -1.3977687 4.1401815 -0.7275132 debye
dipolederiv: -0.0722132 -0.2182579 -0.0096482 0.0097845 0.1612654 0.1146074 0.0715492 -0.1893417 -0.083012 0.1630881 -0.0101437 -0.055956 -0.0148641 0.0546137 -0.0789967 -0.0560772 -0.0750043 0.0922642 -0.2283506 0.0677383 -0.0885892 -0.0385431 -0.2435537 -0.0708653 0.0101743 -0.0975833 -0.246724 -0.0754978 0.2495717 0.1069837 0.2526703 -0.869254 0.0306057 0.1000702 0.0530595 0.0712356 -0.4030234 -0.0145026 -0.2666875 0.0427018 0.418105 0.3041102 -0.2563649 0.2321392 -0.4711319 -0.2009011 0.2308073 0.229337 -0.0350535 -0.5875401 -0.1569131 0.1277475 0.1891974 -0.0325365 1.4887539 -0.017833 0.0645357 0.0098064 1.6302474 -0.1234768 0.0978693 -0.1924575 1.5388819 -0.7586739 -0.0734277 -0.2963403 -0.1529261 -0.7142287 -0.2285015 -0.3835608 -0.1771905 -0.9986614 -0.7815656 -0.2835811 0.2284905 -0.1860552 -0.9719652 0.3223498 0.1930625 0.4085073 -0.7763917 -0.4441017 0.2041182 0.1102106 0.2142048 -0.4159317 -0.0712365 0.1061826 -0.0661777 -0.3352705 0.3079407 -0.1684545 -0.0568787 -0.1326773 0.6570953 -0.0431097 -0.0455424 -0.0899938 0.2024614 -0.0524523 -0.1163881 0.0323025 -0.0008812 -0.1232957 0.0293742 0.0139143 0.0331052 0.0895439 0.0401828 0.0530931 -0.0679385 -0.0187633 0.0554323 -0.0437242 -0.0942481 0.0528514 -0.002953 0.0168142 0.09726 0.0701785 0.0505959 -0.05099 0.0157765 0.1152236 -0.0811112 -0.047706 unknown
polarizability: 75.4475484|-11.466507|99.3796649|12.2256348|0.7119076|80.5325892 unknown
InChI: InChI=1/C3H5BF2N3/c1-9-2-3(4(5)6)7-8-9/h2,4H,1H3
charge -1 multiplicity 1
14 atoms
C  2.87101102 1.75858973 1.004992
H  3.251417 2.39930906 1.78309343
C  3.0630057 0.41853351 0.74857625
N  2.04338844 2.20880777 0.03541252
N  1.7245128 1.212718 -0.7985532
N  2.33233159 0.14165579 -0.37812251
B  3.9569096 -0.64605855 1.57754868
F  4.68091523 0.09500149 2.60082652
F  3.09807527 -1.58759217 2.26167528
H  4.75566409 -1.25917025 0.87122959
C  1.51785557 3.53935686 -0.16801033
H  2.33039024 4.25077937 -0.32800378
H  0.88166144 3.51200627 -1.05116375
H  0.92620602 3.85118166 0.69484574
