program: Gaussian 16
title: f_quinoline_hydride
version: AS64L-G16RevC.02
method: RwB97XD
basis: GenECP
operation: Freq
keyword: #N
keyword: Geom=AllCheck
keyword: Guess=TCheck
keyword: SCRF=Check
keyword: GenChk
keyword: RwB97XD/GenECPFreq
converged: YES YES YES YES
title: Mulliken charges:
elementType: C C C C C C H C H H C C H H H N B F F H
charge: 0.102130 -0.681976 -1.585669 0.805087 -0.195816 -0.385154 0.208735 0.733985 0.155768 0.199136 -0.749981 0.087694 0.213300 0.202694 0.226237 0.099727 0.348290 -0.327538 -0.305270 -0.151380
chargesum: -1.00000
title: Mulliken charges with hydrogens summed into heavy atoms:
elementType: C C C C C C C C C N B F F
charge: 0.310865 -0.681976 -1.585669 0.805087 -0.040048 -0.186017 0.947285 -0.547287 0.313931 0.099727 0.196910 -0.327538 -0.305270
1716.lowfreq: -28.6833 -7.9460 0.0006 0.0007 0.0007 27.7997 68.5629 88.0576 151.9573
frequency: 68.3877 87.5050 151.6114 173.9699 199.8856 280.6664 311.4993 412.9813 438.4291 462.9376 481.7153 510.0998 551.4242 564.5885 630.8617 665.0972 725.8146 771.5874 817.7024 828.2006 840.0687 850.6922 872.8879 898.6976 953.6572 965.0386 1000.1752 1007.8250 1013.8038 1052.3490 1083.4807 1104.8812 1122.4291 1154.6430 1180.5553 1229.1210 1262.9729 1274.4468 1346.0867 1400.5591 1419.6233 1458.5480 1504.8902 1546.7591 1631.0931 1661.9705 1682.6727 2349.7751 3139.3241 3162.7125 3169.9173 3181.1637 3195.2004 3203.5105
redmass: 8.9434 6.2649 7.8867 4.2940 4.6342 10.8150 6.5793 5.1070 4.5184 7.8582 3.3063 4.5267 6.9577 5.2393 5.1221 4.4438 3.7002 1.2922 2.1133 3.5055 3.7949 5.3522 4.9688 4.7027 1.3377 1.4243 1.3687 2.1757 1.5508 2.7253 1.6112 1.5845 1.7155 1.2872 1.3372 2.1362 2.0806 1.7272 3.0379 3.9402 2.2005 2.1576 2.9614 3.9438 7.2992 5.6404 6.7528 1.0780 1.0889 1.0854 1.0892 1.0934 1.0943 1.0971
irintensity: 0.1281 0.3551 1.1660 4.2578 0.2928 9.8857 0.6785 1.4863 5.7441 2.4187 0.3776 5.0362 0.0815 5.3461 19.1907 11.0739 13.1167 12.1575 69.2394 40.7833 46.0417 124.3399 69.3408 133.4568 2.7664 0.1062 2.3770 13.9761 6.1782 1.8120 72.3730 62.8121 255.6914 9.8428 87.2352 1.7314 61.8154 1.4704 4.0503 40.2306 3.4525 1.5443 9.2424 40.9464 15.4910 4.5700 32.6413 486.7080 52.2965 5.1079 16.4943 35.9283 46.3533 35.8402
temp: 298.150 k
press: 1.00000 atm
elementType: 6 6 6 6 6 6 1 6 1 1 6 6 1 1 1 7 5 9 9 1
symmnumber: 1
zpe: 377161.6 jmol-1
zpe.correction: 0.143653 hartree
zpe.thermalcorrener: 0.153618 hartree
zpe.thermalcorrenthalpy: 0.154562 hartree
zpe.thermalcorrgfe: 0.107650 hartree
zpe.sumelectzpe: -626.501435 hartree
zpe.sumelectthermal: -626.491470 hartree
zpe.sumelectthermalent: -626.490526 hartree
zpe.sumelectthermalfe: -626.537439 hartree
dipole: 11.6520 3.5587 -0.5259
dipole: 12.1947
quadrupole: -103.5818 -80.1415 -84.4626
quadrupole: -7.9520 1.8137 1.6931
quadrupole: -14.1865 9.2538 4.9327 -7.9520 1.8137 1.6931
hfenergy: -626.6450883 hartree
pointgroup: C01 [X(C9H7B1F2N1)]
dipole: 4.6180814 1.4794485 -0.1015915 debye
dipolederiv: 0.0651045 -0.076249 0.0000605 -0.2087041 -0.2047529 -0.0166042 0.0190285 0.0086002 -0.1793769 -0.3031875 0.0475318 0.0297342 0.0171012 -0.2188222 -0.0059029 -0.1042274 -0.0787127 -0.2219968 0.3610528 -0.4636854 0.0070159 0.0072157 0.1600274 0.0024863 0.0067379 -0.013916 0.11078 -0.4657023 0.203209 -0.0246621 -0.2261034 0.0472894 -0.0114282 -0.018491 0.0090607 0.0390314 -0.0709601 0.0144063 0.009096 0.0868941 0.021212 0.003439 0.0068132 -0.005837 -0.2137073 0.0672961 0.1272994 0.0129712 0.0966047 0.1474453 0.0019872 0.0254611 0.0224804 -0.1500058 -0.0478578 0.119609 -0.0091402 0.0952735 0.0397508 0.0068907 -0.0176342 0.0028976 0.1374667 0.3062497 -0.1244956 0.0217922 -0.0753458 0.3708212 -0.0006859 0.0186468 -0.0036445 -0.1375678 -0.0869736 -0.1462784 -0.0129747 -0.074897 -0.026011 -0.0037341 -0.0137122 -0.0065278 0.1573706 0.0711386 0.0317223 -0.0046035 0.0328177 -0.198833 0.0012151 -0.0072326 0.000608 0.1517724 0.0072974 -0.1684745 0.0071387 0.0585547 -0.5084389 -0.0007019 0.0068512 -0.0157263 -0.1719017 0.2742579 0.3051993 0.016077 0.0458636 0.5005065 0.0100055 0.0136427 0.0174383 -0.0237749 -0.0682128 -0.0749957 -0.0104411 -0.1373632 0.003464 -0.0072142 -0.0094293 -0.0018666 0.1382812 -0.1100369 0.1082114 -0.0129691 0.0990446 0.0308181 0.0040234 -0.011639 0.004778 0.1638565 0.0523969 0.0319946 -0.0032433 0.0800843 -0.2063497 -0.0008129 -0.0022865 -0.0027351 0.1129131 -0.5469621 -0.0014879 -0.0118787 -0.0212854 -0.4506518 -0.0032915 -0.0182064 0.0037968 -0.3012595 1.8225019 0.0584502 -0.0248969 0.1649037 1.3301157 -0.1027443 -0.0711804 -0.1452565 1.3925409 -1.2989818 0.2698789 -0.0716422 0.3159095 -0.7060459 0.0288076 0.0109123 -0.0079079 -0.4994206 -0.7001477 -0.161729 0.1262579 -0.2099239 -0.714423 0.3065494 0.2191686 0.392758 -1.0709841 -0.3282731 -0.1001167 -0.0436917 -0.1466441 -0.4171221 -0.2122839 -0.0532234 -0.1802875 -0.4340174 unknown
polarizability: 183.1270117|-20.7970981|189.3705784|5.0724761|0.806015|87.2516559 unknown
InChI: InChI=1/C9H7BF2N/c11-10(12)8-5-1-3-7-4-2-6-13-9(7)8/h1-6,10H
charge -1 multiplicity 1
20 atoms
C  -1.03630334 1.71717618 -0.10139244
C  -0.91910518 0.34349804 -0.08834546
C  0.40905599 -0.18787426 -0.03271478
C  1.53907168 0.68116297 0.02333271
C  1.34607494 2.08491285 0.0167404
C  0.0762525 2.58858205 -0.04903154
H  -2.0335174 2.14226249 -0.15363484
C  2.82858815 0.10272064 0.08258147
H  2.21206068 2.73917353 0.06088369
H  -0.08275875 3.66288147 -0.05817251
C  2.95824554 -1.25772304 0.07773502
C  1.78137511 -2.03809317 0.00932805
H  3.70006276 0.75004181 0.12907073
H  3.92866723 -1.73899276 0.12093019
H  1.86151298 -3.12400161 -0.004031
N  0.57082778 -1.54548596 -0.04187946
B  -2.25166377 -0.6016168 -0.14807626
F  -3.41840583 0.26292928 -0.26043098
F  -2.39839747 -1.33061504 1.09148091
H  -2.24288761 -1.38053066 -1.09929791
