program: Gaussian 16
title: h_biphenylene_hydride
version: AS64L-G16RevC.02
method: RwB97XD
basis: GenECP
operation: Freq
keyword: #N
keyword: Geom=AllCheck
keyword: Guess=TCheck
keyword: SCRF=Check
keyword: GenChk
keyword: RwB97XD/GenECPFreq
converged: YES YES NO YES
title: Mulliken charges:
elementType: C C C C C C C H C H H C H C H C C H B N C H H H C H H H H H H
charge: 0.377422 0.420188 -0.029986 -0.061006 -0.513559 -0.320427 -0.262870 0.167595 -0.027820 0.210426 0.169153 -0.630246 0.174054 -0.387378 0.193786 -0.221080 0.169698 0.204543 -0.509919 0.188880 -0.423090 0.149441 0.171895 0.046952 -0.373698 0.167581 0.140968 0.152522 -0.122846 -0.120385 -0.100795
chargesum: -1.00000
title: Mulliken charges with hydrogens summed into heavy atoms:
elementType: C C C C C C C C C C C C B N C C
charge: 0.377422 0.420188 -0.029986 -0.061006 -0.345965 -0.320427 -0.052444 0.141332 -0.456191 -0.193593 -0.016536 0.169698 -0.853944 0.188880 -0.054801 0.087373
1716.lowfreq: -0.0006 -0.0003 0.0006 10.5386 13.2936 28.3563 67.2549 112.3517 115.8749
frequency: 66.5932 111.8252 115.7722 156.3750 169.2976 199.3562 213.3733 253.0410 275.2254 287.5344 311.5841 332.0413 358.3464 363.2824 388.0869 469.5252 478.3838 488.8023 512.7126 564.9136 586.7544 607.9588 634.1350 644.6791 727.2340 741.9850 767.5476 774.3638 787.4208 814.0441 868.1375 884.6561 891.1634 914.9736 928.8650 970.3250 995.3214 995.6038 1002.8859 1053.1068 1072.1833 1088.1768 1126.3793 1127.9208 1134.6514 1163.0779 1167.7668 1179.9036 1185.7780 1192.7584 1196.6704 1210.7317 1222.8361 1247.7449 1294.0761 1302.4543 1382.8791 1400.4197 1437.7268 1452.8575 1480.0872 1488.2543 1489.4482 1498.3297 1504.2460 1509.0930 1513.1772 1534.4864 1631.0544 1650.5058 1661.1684 1725.9609 2279.1656 2308.5844 2358.8361 2938.6389 2949.0333 3081.3760 3111.7862 3128.1810 3154.7994 3174.1418 3175.1613 3192.9592 3193.2510 3202.3468 3214.7558
redmass: 3.1207 4.3603 3.3896 2.9913 3.6068 1.1266 2.8034 1.9912 2.4978 1.2642 1.5909 2.6573 3.7743 4.9174 2.5253 4.1271 3.2526 3.2884 4.2055 3.5768 3.9754 5.4114 4.0304 5.6592 3.2393 4.5948 1.7100 1.2518 4.6140 4.4309 1.7553 1.4750 1.5418 2.6797 1.6297 1.2818 1.5233 2.6112 6.3757 2.8104 1.8836 1.4229 2.0522 1.3804 1.6989 1.4758 1.3087 1.3915 1.2917 1.6601 1.7611 1.3179 2.2555 1.8358 2.5076 3.5668 2.8476 2.4339 2.4484 1.2067 1.2490 1.8411 1.1653 1.0728 1.6042 1.7387 1.7175 1.5284 8.7365 8.9582 6.7100 8.2546 1.0813 1.0742 1.0849 1.0594 1.0597 1.0727 1.0797 1.1037 1.0849 1.0917 1.0871 1.0974 1.0958 1.0937 1.0926
irintensity: 9.5629 0.4566 8.3163 1.7410 5.9513 3.1194 5.2058 6.4412 5.2971 0.3307 5.8469 10.9442 4.4333 4.3980 1.4030 2.9285 3.0052 3.5174 1.6464 2.6750 7.3532 2.8880 3.9459 3.2887 14.5058 7.5085 90.4675 41.4512 25.8544 9.2775 15.3405 1.9780 2.7268 9.0564 4.2055 1.1759 11.7915 54.0004 8.5390 4.2572 2.6988 9.4778 5.5338 7.6018 36.2594 36.5357 49.9367 68.1881 0.6226 27.9754 10.9934 20.0438 15.6538 0.4696 8.5858 12.5876 131.9635 16.5359 25.1837 2.5676 26.6758 12.6516 14.1809 24.9676 37.8851 12.2282 2.4551 108.9120 15.3577 49.6241 58.3645 102.6235 419.2499 495.0442 309.0336 133.7802 210.3585 47.7609 36.2037 30.2419 8.9624 67.5875 9.3397 6.8567 53.8208 33.2145 29.1738
temp: 298.150 k
press: 1.00000 atm
elementType: 6 6 6 6 6 6 6 1 6 1 1 6 1 6 1 6 6 1 5 7 6 1 1 1 6 1 1 1 1 1 1
symmnumber: 1
zpe: 660596.2 jmol-1
zpe.correction: 0.251608 hartree
zpe.thermalcorrener: 0.265259 hartree
zpe.thermalcorrenthalpy: 0.266203 hartree
zpe.thermalcorrgfe: 0.212461 hartree
zpe.sumelectzpe: -621.822724 hartree
zpe.sumelectthermal: -621.809073 hartree
zpe.sumelectthermalent: -621.808129 hartree
zpe.sumelectthermalfe: -621.861870 hartree
dipole: -5.9356 9.4432 0.5296
dipole: 11.1663
quadrupole: -105.8532 -136.1622 -108.7093
quadrupole: 15.5209 0.9970 -1.9734
quadrupole: 11.0551 -19.2540 8.1990 15.5209 0.9970 -1.9734
hfenergy: -622.0743317 hartree
pointgroup: C01 [X(C14H15B1N1)]
dipole: -2.3897305 3.7692845 0.1881234 debye
polarizability: 315.3931098|-16.2463007|275.3146839|15.5349335|-9.2777365|141.9889087 unknown
InChI: InChI=1/C14H15BN/c1-16(2)12-8-4-6-10-9-5-3-7-11(15)13(9)14(10)12/h3-8H,1-2,15H3
charge -1 multiplicity 1
31 atoms
C  1.06081787 -0.27504075 0.06531914
C  1.66556002 1.00599333 0.13629935
C  0.32956012 1.66680414 -0.04892863
C  -0.29875121 0.40293357 -0.09514071
C  -0.3315875 2.85633722 -0.20440437
C  -1.66813138 0.27917852 -0.25985589
C  -1.72266693 2.74268676 -0.40483543
H  0.16117275 3.82138547 -0.18520729
C  -2.3615183 1.51519679 -0.42298996
H  -2.31986389 3.63958139 -0.53659095
H  -3.43618572 1.5056242 -0.55646027
C  3.01024298 1.19064657 0.28616769
H  3.48371214 2.16530073 0.3347402
C  3.76199817 -0.00686072 0.36418771
H  4.84007201 0.05057585 0.486731
C  3.15743953 -1.24837862 0.26798434
C  1.75223397 -1.47104104 0.09566421
H  3.79318144 -2.12973771 0.30901371
B  1.16601179 -2.97576755 -0.05778805
N  -2.32781804 -0.95500179 -0.27025866
C  -1.99268618 -1.85352274 0.82437792
H  -2.48655828 -1.54289626 1.76144444
H  -2.31364996 -2.86692312 0.57486827
H  -0.91795905 -1.89334887 0.97779237
C  -3.73791138 -0.96301242 -0.58496599
H  -4.05872669 -1.99967555 -0.70819916
H  -4.36432859 -0.50704786 0.20288774
H  -3.92691573 -0.44075042 -1.5252282
H  0.77805236 -3.39093511 1.04060801
H  2.06352298 -3.72115777 -0.45480714
H  0.22053771 -3.00378425 -0.84238942
