program: Gaussian 16
title: h_dibenzofuran_hydride
version: AS64L-G16RevC.02
method: RwB97XD
basis: GenECP
operation: Freq
keyword: #N
keyword: Geom=AllCheck
keyword: Guess=TCheck
keyword: SCRF=Check
keyword: GenChk
keyword: RwB97XD/GenECP
keyword: Freq
converged: YES YES YES YES
title: Mulliken charges:
elementType: C C O C C C C C H C H H C H C H C C H B N C H H H C H H H H H H
charge: -1.319084 1.214147 0.022965 1.349906 -1.352498 -0.400343 -0.420972 -0.379890 0.157328 0.446170 0.213418 0.176628 -0.341735 0.148036 -0.360964 0.192374 -0.282964 0.338275 0.201143 -0.359114 0.082488 -0.376662 0.150527 0.176675 0.155133 -0.456821 0.151934 0.154539 0.170399 -0.160992 -0.161604 -0.128444
chargesum: -1.00000
title: Mulliken charges with hydrogens summed into heavy atoms:
elementType: C C O C C C C C C C C C C B N C C
charge: -1.319084 1.214147 0.022965 1.349906 -1.352498 -0.243015 -0.420972 -0.166472 0.622798 -0.193699 -0.168590 -0.081822 0.338275 -0.810153 0.082488 0.105673 0.020051
1716.lowfreq: -33.0518 -17.0357 -0.0004 0.0004 0.0004 18.0772 68.8633 75.3672 112.1384
frequency: 64.9562 74.0292 111.5403 141.1246 158.4569 183.3504 213.4597 248.2489 270.6328 284.3557 304.0428 313.6064 321.9940 345.9301 372.3585 395.9580 485.2409 497.8963 507.6069 561.5596 574.1588 588.0740 595.7270 619.7163 631.1105 705.0010 751.4971 753.9298 767.2509 778.4952 804.6621 846.3250 872.5473 884.6198 887.7197 902.1601 934.8795 943.6792 975.6373 986.0296 1020.9745 1081.1340 1086.2231 1104.3159 1128.1512 1137.2751 1165.0361 1174.7312 1177.7236 1189.1833 1192.4450 1207.5202 1226.1751 1235.6767 1260.8239 1277.3159 1306.6155 1338.2589 1348.3446 1388.2025 1394.1924 1435.2688 1449.7741 1467.2187 1481.0942 1490.2162 1500.1290 1507.4695 1522.2021 1527.5456 1553.3354 1636.2982 1649.5112 1664.2204 1681.7277 2313.5508 2330.1857 2334.6867 2950.7016 2969.7797 3083.8945 3096.6336 3130.7970 3156.2007 3173.9212 3181.9073 3183.0129 3193.3147 3204.6578 3225.3146
redmass: 3.0591 3.1172 4.6286 3.8021 2.0014 1.5765 2.6268 1.9918 3.1110 1.2865 1.4730 3.7652 3.4075 3.6362 3.4424 2.8103 4.8315 3.5665 3.3922 3.8331 4.0273 4.2603 6.7064 5.1565 4.4164 6.9242 1.9855 3.0668 4.9774 1.2745 3.0877 2.4944 4.2523 1.5155 1.7085 2.6306 2.3857 1.7090 1.2775 1.2962 3.1269 2.1060 1.4406 1.9280 1.2612 2.3010 1.3353 1.4216 1.4153 1.3411 1.0565 1.5172 2.0975 2.3550 3.1365 1.7505 2.9887 2.1242 6.5708 3.5187 4.3261 2.8626 1.1869 1.9102 1.4178 1.0506 1.1068 1.0773 1.5781 1.7720 2.8490 6.8647 7.5181 6.8251 8.5590 1.0683 1.1019 1.0713 1.0583 1.0575 1.0742 1.0826 1.1040 1.0859 1.0903 1.0975 1.0868 1.0964 1.0949 1.0917
irintensity: 12.4777 2.4969 1.2520 12.5074 1.2836 1.8606 5.9476 4.6561 5.8411 0.7138 0.3575 9.6128 2.6085 3.1079 2.1249 1.0939 1.4706 3.2494 1.1439 0.3534 8.4553 0.5340 8.8776 3.2841 5.5335 4.1296 20.1000 12.1510 3.0988 132.3413 7.6394 35.4466 17.3305 6.5917 6.5964 5.8746 3.6484 5.6726 0.6276 0.7387 111.1480 16.3197 15.3863 17.3585 1.9222 64.2525 47.6088 21.5728 56.5590 21.3734 4.2462 103.7577 88.6782 63.0718 11.4909 1.1919 109.9994 4.3313 2.9759 90.9010 52.8525 48.2794 0.6708 34.4658 18.5439 14.5435 21.2539 5.9277 24.1901 7.0042 95.4299 15.1815 35.9189 92.2096 77.0426 500.1965 451.0303 350.5397 124.8024 160.6054 43.3132 52.8734 30.6720 11.1237 46.3669 1.1631 11.8180 46.9822 31.5347 16.3088
temp: 298.150 k
press: 1.00000 atm
elementType: 6 6 8 6 6 6 6 6 1 6 1 1 6 1 6 1 6 6 1 5 7 6 1 1 1 6 1 1 1 1 1 1
symmnumber: 1
zpe: 677053.2 jmol-1
zpe.correction: 0.257876 hartree
zpe.thermalcorrener: 0.272137 hartree
zpe.thermalcorrenthalpy: 0.273081 hartree
zpe.thermalcorrgfe: 0.217676 hartree
zpe.sumelectzpe: -697.114664 hartree
zpe.sumelectthermal: -697.100403 hartree
zpe.sumelectthermalent: -697.099459 hartree
zpe.sumelectthermalfe: -697.154864 hartree
dipole: 9.6607 11.0455 -2.5157
dipole: 14.8883
quadrupole: -120.2139 -146.4488 -115.2292
quadrupole: -27.7309 5.3312 7.1647
quadrupole: 7.0834 -19.1515 12.0680 -27.7309 5.3312 7.1647
hfenergy: -697.37254 hartree
pointgroup: C01 [X(C14H15B1N1O1)]
dipole: 3.8343056 4.3257012 -0.7501588 debye
polarizability: 312.5602361|7.4224727|270.7888035|-23.9748246|-19.6809057|147.0765753 unknown
InChI: InChI=1/C14H15BNO/c1-16(2)12-8-4-6-10-9-5-3-7-11(15)13(9)17-14(10)12/h3-8H,1-2,15H3
charge -1 multiplicity 1
32 atoms
C  -1.40504677 -0.61130761 0.34654874
C  -1.58403364 0.76987366 0.23748722
O  -0.07463984 -0.93710101 0.16891631
C  -0.26925188 1.32557689 -0.01640284
C  0.59245847 0.22724483 -0.03521661
C  0.22506538 2.61143691 -0.24789874
C  1.97455059 0.33167373 -0.26401251
C  1.58125068 2.74343083 -0.48569096
H  -0.43356458 3.47234788 -0.24783236
C  2.43812087 1.63372449 -0.48509827
H  2.00490288 3.72508571 -0.66973155
H  3.49296878 1.80096555 -0.66030477
C  -2.8657984 1.30617235 0.38152978
H  -3.04222213 2.37368363 0.30129128
C  -3.89820333 0.41613148 0.63280126
H  -4.91083346 0.79016182 0.75237319
C  -3.66018303 -0.96456185 0.73978504
C  -2.39811674 -1.55708674 0.60375959
H  -4.50414152 -1.61887526 0.94248056
B  -2.1024231 -3.14343868 0.73642754
N  2.79603595 -0.80246993 -0.31359212
C  4.16521065 -0.59733946 -0.73226369
H  4.76792631 -0.04395786 0.00880858
H  4.63126518 -1.57310923 -0.88362279
H  4.19784182 -0.05674378 -1.68049943
C  2.68663927 -1.74304088 0.79685908
H  3.20785954 -2.66487942 0.52945533
H  3.14175761 -1.33886212 1.71564587
H  1.64614395 -1.98962748 0.99387595
H  -1.30214879 -3.34024473 1.65507087
H  -1.59460565 -3.56501871 -0.30411005
H  -3.1521341 -3.74762602 0.96393951
