program: Gaussian 16
title: Me_H-H-
version: ES64L-G16RevC.01
method: RwB97XD
basis: GenECP
operation: Freq
keyword: #N
keyword: Geom=AllCheck
keyword: Guess=TCheck
keyword: SCRF=Check
keyword: GenChk
keyword: RwB97XD/GenECPFreq
converged: YES YES YES YES
title: Mulliken charges:
elementType: C C C C C C H H H H N B C H H H C H H H H H H
charge: -0.437816 -0.239289 0.318922 -0.972541 0.502790 -0.389126 0.166441 0.193351 0.143939 0.180477 0.267166 -0.351690 -0.339268 0.113525 0.149998 0.156614 -0.392034 0.154401 0.117640 0.071030 -0.130726 -0.128085 -0.155719
chargesum: -1.00000
title: Mulliken charges with hydrogens summed into heavy atoms:
elementType: C C C C C C N B C C
charge: -0.271374 -0.045938 0.318922 -0.972541 0.646729 -0.208649 0.267166 -0.766220 0.080869 -0.048963
1716.lowfreq: -36.0460 -21.7495 -0.0006 0.0004 0.0006 27.6076 93.2442 120.4496 206.4058
frequency: 90.5935 117.4092 204.7258 247.5576 275.0310 327.5183 341.2292 350.7244 384.0704 397.1079 454.7020 481.5138 517.1452 569.3377 586.1002 702.9835 719.6747 776.4102 793.1771 850.4994 882.5515 916.4212 952.1022 982.1929 987.3315 1081.1869 1082.8062 1095.2721 1128.1554 1144.6933 1167.6352 1178.9364 1181.7902 1193.4835 1213.7688 1236.5861 1256.1785 1309.0900 1328.2636 1365.3307 1438.4864 1464.8505 1474.9233 1486.9399 1490.2003 1515.8203 1518.7273 1527.7333 1624.3123 1644.8290 2262.5040 2320.7363 2342.2363 2908.9274 2918.1737 3058.6965 3060.7908 3120.2135 3148.8343 3163.3995 3164.8508 3180.1400 3200.8869
redmass: 2.8787 2.9318 2.6898 1.5099 1.9801 1.6301 2.2474 1.3560 2.4878 1.3388 2.6932 2.9697 3.3585 3.6654 4.1538 4.4672 1.7015 1.8111 3.9579 1.3017 1.4593 1.6232 1.4366 1.2737 3.0953 1.9244 1.8456 2.4176 1.2659 1.3564 1.6162 1.4877 1.5531 1.2723 1.1253 1.0861 3.2151 2.2736 2.9535 2.7323 1.1653 1.4996 1.5100 1.0806 1.1973 1.0515 1.8218 1.1642 5.6018 5.4313 1.0832 1.0720 1.0870 1.0618 1.0602 1.0788 1.0708 1.1008 1.0845 1.0887 1.0968 1.0948 1.0931
irintensity: 2.2527 7.0674 4.6677 3.2262 11.1990 8.8350 3.0613 4.8425 1.3741 2.1258 2.7725 2.7703 0.6356 7.5502 5.3031 6.9821 58.1929 39.5484 9.8531 2.2336 7.6727 19.0843 2.0295 0.0433 42.3782 34.9171 22.4167 24.0057 3.9121 63.1301 18.6150 55.7861 19.6684 0.5595 33.7932 18.1350 30.1605 32.9154 17.5544 75.8354 1.7211 15.7940 13.6269 22.1048 31.7517 9.3950 36.3446 56.3523 8.2229 50.4247 449.5574 476.4751 396.8924 166.7047 222.1292 56.3068 95.8657 36.8375 8.4706 30.6686 3.1652 78.1204 36.0214
temp: 298.150 k
press: 1.00000 atm
elementType: 6 6 6 6 6 6 1 1 1 1 7 5 6 1 1 1 6 1 1 1 1 1 1
symmnumber: 1
zpe: 507865.6 jmol-1
zpe.correction: 0.193436 hartree
zpe.thermalcorrener: 0.203023 hartree
zpe.thermalcorrenthalpy: 0.203967 hartree
zpe.thermalcorrgfe: 0.159504 hartree
zpe.sumelectzpe: -392.120250 hartree
zpe.sumelectthermal: -392.110663 hartree
zpe.sumelectthermalent: -392.109719 hartree
zpe.sumelectthermalfe: -392.154181 hartree
dipole: -11.5997 -11.4315 -2.8267
dipole: 16.5295
quadrupole: -108.1688 -96.1852 -74.0581
quadrupole: -29.6079 -6.4881 -8.3206
quadrupole: -15.3648 -3.3812 18.7459 -29.6079 -6.4881 -8.3206
hfenergy: -392.3136857 hartree
pointgroup: C01 [X(C8H13B1N1)]
dipole: -3.4202246 1.2998211 -0.9502919 debye
dipolederiv: -0.0670364 -0.0857627 0.0635838 0.0294844 -0.0773329 -0.0476307 0.0440991 -0.0502127 -0.1669799 -0.0692172 0.0456564 0.017347 -0.1506996 0.1765436 -0.1549421 0.0726382 -0.1201186 -0.1198872 0.1668099 0.1886905 0.051956 0.043949 -0.5204512 0.1142845 0.1560098 0.2501187 -0.2342168 -0.0411363 0.2571801 -0.1819998 0.3052006 1.3414691 -0.3315937 -0.1930957 -0.4018303 0.0050807 -0.0553114 -0.1817692 0.1120797 0.1242153 -0.2186345 -0.0126129 -0.0225223 -0.1514803 -0.1537818 -0.0515549 0.0384264 0.0289995 -0.0716781 -0.0244554 -0.0914968 0.0760118 -0.1002871 -0.1737111 0.031144 -0.1002554 0.0024286 -0.1135661 -0.1689243 0.0912128 -0.0004598 0.0887024 0.1312795 0.0015456 0.1331805 -0.0770958 0.0958059 -0.0615035 0.0868945 -0.0658549 0.0806212 0.0756092 -0.0325294 0.1047498 -0.0870074 0.1008867 0.002289 0.0855624 -0.0825457 0.0871742 0.1000417 -0.1851792 -0.0971397 -0.0587047 -0.071284 0.056707 0.0154381 -0.0711189 0.0282529 0.1311919 -0.6557875 -0.3545966 0.0664307 -0.0796212 -1.3885944 0.1271918 0.0004861 0.2544116 -0.6143865 0.4019068 -0.0570125 -0.0290553 -0.0783242 0.5150741 -0.0071767 -0.0828877 0.0110025 0.4382215 0.5127051 -0.3937632 0.0628004 -0.2026746 0.3869842 -0.1340086 0.0127987 -0.2034326 0.402935 -0.2402884 0.2394135 -0.0226207 0.1015179 -0.0604238 0.0313071 0.1650128 -0.0799806 -0.0631615 -0.0115772 -0.1302856 0.072281 -0.0597387 -0.1644284 0.1408809 0.0348319 0.0840404 0.0405598 0.0198045 0.0295138 -0.080825 -0.0383546 0.0097837 -0.1435927 -0.0578326 -0.0701224 -0.079848 0.3864097 0.2714991 -0.1574612 0.1137825 0.4332933 0.2948368 -0.1209593 0.4373833 0.3814896 -0.0118079 -0.1348244 0.0549495 -0.1356125 -0.1732336 0.0189455 0.0761139 0.1025245 0.0047268 -0.1686552 0.2140344 0.2036664 0.0000027 -0.1148939 -0.1086753 0.0406123 -0.1954398 -0.0877986 0.0700097 -0.0315426 -0.0322471 -0.0122081 0.1444755 0.0272552 -0.0305104 -0.0106612 -0.0041193 -0.2999023 -0.0143725 -0.0623874 -0.0672694 -0.2515781 -0.1927838 -0.1713776 -0.2176595 -0.5285715 -0.3691279 0.1453659 -0.0208884 0.3020641 -0.5517566 0.017496 0.0162372 -0.0111975 -0.1261721 -0.3312239 -0.086386 0.0737701 -0.1358781 -0.2904088 0.1732077 0.2043131 0.1881907 -0.3585013 unknown
polarizability: 169.2798119|9.0471255|177.3882912|14.08309|-16.8301209|118.0630196 unknown
InChI: InChI=1/C8H13BN/c1-10(2)8-6-4-3-5-7(8)9/h3-6H,1-2,9H3
charge -1 multiplicity 1
23 atoms
C  -0.42148516 0.67215748 0.62632071
C  0.90613046 1.04942231 0.82479268
C  1.42882015 2.30308202 0.48052908
C  0.5002794 3.21643182 -0.08858999
C  -0.83590299 2.84447096 -0.29443854
C  -1.29967859 1.57865305 0.05339459
H  -0.75695175 -0.3234933 0.90254496
H  1.59561708 0.32130645 1.24520316
H  -1.53641509 3.54904993 -0.72827349
H  -2.33858677 1.31575075 -0.12325811
N  0.93669743 4.51046643 -0.48731474
B  3.01865624 2.57617741 0.71966022
C  0.09450778 5.25121019 -1.39398847
H  -0.83021091 5.64243994 -0.92640633
H  0.65705422 6.11087061 -1.77081756
H  -0.18889344 4.6308893 -2.2472786
C  1.44065411 5.35161318 0.58141911
H  2.00782369 6.18651453 0.1568105
H  0.61741869 5.76919732 1.19217107
H  2.10439571 4.78054236 1.22681889
H  3.20557281 3.11537226 1.81945133
H  3.6077208 1.49238708 0.73014777
H  3.49642603 3.30356696 -0.14964518
