program: Gaussian 16
title: Me_H-H-
version: ES64L-G16RevC.01
method: RwB97XD
basis: GenECP
operation: Freq
keyword: #N
keyword: Geom=AllCheck
keyword: Guess=TCheck
keyword: SCRF=Check
keyword: GenChk
keyword: RwB97XD/GenECPFreq
converged: YES YES YES YES
title: Mulliken charges:
elementType: C H C N N B H C H H H H H C C H H H
charge: -0.158912 0.172394 -0.057146 0.046887 -0.183888 -0.232618 -0.172008 -0.390908 0.161389 0.151815 0.190990 -0.171004 -0.182278 0.054426 -0.741881 0.159103 0.165521 0.188118
chargesum: -1.00000
title: Mulliken charges with hydrogens summed into heavy atoms:
elementType: C C N N B C C C
charge: 0.013482 -0.057146 0.046887 -0.183888 -0.757909 0.113286 0.054426 -0.229139
1716.lowfreq: -41.9042 0.0002 0.0004 0.0005 22.6664 48.2977 66.7117 138.8482 147.1452
frequency: 66.4016 138.2149 147.1261 178.8393 202.0005 236.9965 283.3328 296.0839 460.9339 547.7984 634.9623 655.3120 681.6270 711.8127 791.7339 860.1520 914.5463 992.3880 1013.3168 1058.5655 1066.8981 1140.9799 1146.0806 1162.9286 1185.6649 1192.6096 1217.3649 1273.5577 1391.0510 1404.2731 1454.1105 1472.6340 1481.4269 1493.9734 1503.6974 1526.7393 1557.4738 1579.9691 2251.4127 2290.6954 2307.8992 3027.2005 3029.4514 3080.6546 3102.3911 3139.3701 3151.0221 3252.2178
redmass: 1.0578 1.3803 1.7297 1.1010 2.7131 2.4623 2.6596 3.0228 2.6388 3.6134 2.9940 4.1776 4.0482 1.3172 3.3040 1.4409 1.7475 6.1856 1.6188 1.4755 1.6812 1.3373 1.2881 1.0939 1.1609 1.4783 2.2917 6.0640 4.9817 1.2872 1.4627 1.2246 1.0486 1.0599 1.3812 2.0868 3.5988 6.4324 1.0843 1.0919 1.0661 1.0401 1.0411 1.1009 1.0958 1.1033 1.0976 1.0969
irintensity: 0.7399 0.8817 0.5440 0.0880 0.6277 5.9299 2.3996 4.0600 3.1358 10.0604 3.0004 3.5062 11.6580 47.0303 0.2051 28.6913 10.6293 9.4191 8.2265 1.9798 17.4046 77.3567 26.6834 12.9177 31.5663 45.0189 3.9167 8.6672 13.0268 0.6800 59.4443 61.8419 9.0095 8.7805 6.1033 30.6349 60.1435 30.3972 509.3260 545.6262 483.9343 47.2193 124.7348 38.4395 30.3611 20.8656 11.9201 9.0369
temp: 298.150 k
press: 1.00000 atm
elementType: 6 1 6 7 7 5 1 6 1 1 1 1 1 6 6 1 1 1
symmnumber: 1
zpe: 381344.9 jmol-1
zpe.correction: 0.145247 hartree
zpe.thermalcorrener: 0.154168 hartree
zpe.thermalcorrenthalpy: 0.155112 hartree
zpe.thermalcorrgfe: 0.111816 hartree
zpe.sumelectzpe: -330.814034 hartree
zpe.sumelectthermal: -330.805113 hartree
zpe.sumelectthermalent: -330.804169 hartree
zpe.sumelectthermalfe: -330.847464 hartree
dipole: -18.8225 6.0019 -6.7860
dipole: 20.8892
quadrupole: -130.1183 -50.8845 -67.3850
quadrupole: 16.7840 -25.8394 3.9202
quadrupole: -47.3224 31.9114 15.4109 16.7840 -25.8394 3.9202
hfenergy: -330.9592809 hartree
pointgroup: C01 [X(C5H10B1N2)]
dipole: -3.4228601 4.7108134 -2.5672847 debye
dipolederiv: -0.10179 -0.2505243 0.1460461 -0.0390935 -0.006357 -0.021395 0.1554293 -0.2694791 -0.1764504 0.0858865 -0.057077 -0.1130489 -0.0726109 -0.0299155 -0.0783485 -0.1086145 -0.0577755 0.1071695 0.0422508 -0.133789 0.198947 -0.1443084 0.089515 -0.1122498 0.2109331 -0.0922276 -0.0479119 -0.2386581 0.2685692 -0.0755528 0.2442493 -1.1567789 0.0827818 -0.12029 0.3374796 -0.1993445 -0.5761179 0.2129529 -0.1282999 0.1073902 -0.768307 0.0572286 -0.1567007 0.1411828 -0.4985185 0.5248649 0.0286851 -0.0150238 0.0833708 0.5213941 0.0583361 -0.0141771 0.0184651 0.5385394 -0.3635795 0.2330648 0.1073661 0.2110668 -0.3527545 -0.1051378 0.2021949 -0.2004175 -0.394047 0.3099496 -0.1520809 -0.0646078 -0.2020489 0.7322106 -0.0356923 -0.0535765 -0.0862303 0.2706848 -0.0454594 -0.1422826 -0.0325874 -0.0232864 -0.0604899 -0.0039431 -0.0350035 -0.0505703 0.0854296 0.0504141 0.0808229 -0.0466302 0.0389516 0.0040265 -0.0081913 -0.0714477 0.0974192 -0.1319144 -0.1060343 0.1640578 0.0913778 0.050539 -0.0996169 0.0223235 0.1310483 -0.0716563 -0.0160264 -0.3304661 -0.1834268 0.1639656 -0.0844468 -0.4309775 0.2370633 0.0748934 0.2633814 -0.3521682 -0.3941931 -0.0845073 -0.2185953 -0.192419 -0.3307576 -0.1827388 -0.2273552 -0.0892691 -0.3587105 0.1549642 0.0170063 0.0981172 -0.0544035 0.8352718 0.0270478 0.1241706 0.0577022 0.1654678 0.0946616 -0.0292044 -0.0782692 0.0366642 0.0733684 0.0250536 -0.0880022 -0.0327494 0.1028398 -0.1637737 0.0869719 -0.0354146 0.1300537 0.0312302 -0.0202373 0.0572175 -0.0555398 -0.0069498 -0.0096998 -0.0421721 0.0235935 0.000977 0.0246779 0.1380514 -0.0618655 0.0992488 -0.1630856 0.0667802 -0.0170666 -0.0213834 -0.0906453 -0.0757398 -0.079952 -0.0188543 -0.0089643 0.0749963 unknown
polarizability: 111.9609991|-8.8908905|130.599855|20.7799161|-2.7742958|105.1469579 unknown
InChI: InChI=1/C5H10BN2/c1-4-7-5(6)3-8(4)2/h3H,1-2,6H3
charge -1 multiplicity 1
18 atoms
C  2.97185625 1.74918459 0.84079678
H  3.55666151 2.4606716 1.40475401
C  3.02612936 0.37915728 0.781759
N  1.97082083 2.17675734 -0.02155489
N  2.03667646 -0.03087275 -0.12091628
B  4.01580274 -0.62735484 1.56097254
H  4.68957674 -1.28176766 0.75687983
C  1.51366099 3.53260532 -0.20398252
H  2.32833192 4.22028012 0.02728022
H  1.21297654 3.69688387 -1.24108
H  0.66454477 3.76655119 0.44759353
H  3.37050543 -1.41980172 2.2577651
H  4.78044057 0.01981075 2.28950795
C  1.43609587 1.05014517 -0.56430668
C  0.31054891 1.08319298 -1.54535444
H  -0.57430528 1.5838879 -1.13749568
H  0.58802067 1.60057284 -2.47071152
H  0.04128875 0.05705546 -1.79422983
