program: Gaussian 16
title: NO2_H-H-
version: ES64L-G16RevC.01
method: RwB97XD
basis: GenECP
operation: Freq
keyword: #N
keyword: Geom=AllCheck
keyword: Guess=TCheck
keyword: SCRF=Check
keyword: GenChk
keyword: RwB97XD/GenECPFreq
converged: YES YES YES YES
title: Mulliken charges:
elementType: C H C N N B H C H H H H H C F
charge: -0.381091 0.172598 -0.026749 -0.022418 -0.246190 -0.222975 -0.164939 -0.377922 0.174390 0.163746 0.190278 -0.164544 -0.177435 0.297987 -0.214735
chargesum: -1.00000
title: Mulliken charges with hydrogens summed into heavy atoms:
elementType: C C N N B C C F
charge: -0.208493 -0.026749 -0.022418 -0.246190 -0.729894 0.150492 0.297987 -0.214735
1716.lowfreq: -36.5642 -30.0126 0.0004 0.0006 0.0009 22.7595 64.3764 130.1812 188.6546
frequency: 63.6816 129.9366 187.1699 205.1099 249.1029 289.6961 332.6562 513.6992 537.9303 635.4563 660.0860 664.4375 704.8783 817.8120 867.3432 908.0862 974.1439 1068.7171 1136.9965 1150.0766 1158.8649 1181.7509 1192.7047 1211.9951 1264.3029 1374.8838 1458.6015 1492.2309 1504.3817 1536.0780 1575.4646 1620.8007 2269.8079 2308.9651 2320.5440 3044.6864 3112.6778 3156.5282 3259.1378
redmass: 1.1595 2.3023 1.1135 3.3839 2.6026 4.0280 5.9299 4.0784 3.9696 2.1099 6.7212 2.4477 2.8381 4.1025 1.5964 1.7649 6.7534 1.7450 1.3717 1.2858 1.0753 1.3173 1.4075 2.2633 5.2944 5.7566 1.3058 1.0410 1.3577 3.3212 4.7712 7.9577 1.0816 1.0953 1.0654 1.0363 1.1034 1.1020 1.0972
irintensity: 0.4745 1.6668 0.7882 1.5552 5.0263 6.5337 0.3656 0.6761 4.6769 14.6079 25.3644 49.3752 4.3594 44.8960 14.2296 11.2039 2.3771 6.2032 98.7089 4.6506 9.7254 69.0933 32.0879 17.6129 85.4836 52.5175 22.2170 13.0819 27.3500 122.9338 95.7997 302.5167 455.8567 525.8338 461.7941 93.1357 30.1414 10.7623 5.2601
temp: 298.150 k
press: 1.00000 atm
elementType: 6 1 6 7 7 5 1 6 1 1 1 1 1 6 9
symmnumber: 1
zpe: 287949.7 jmol-1
zpe.correction: 0.109674 hartree
zpe.thermalcorrener: 0.117766 hartree
zpe.thermalcorrenthalpy: 0.118710 hartree
zpe.thermalcorrgfe: 0.076928 hartree
zpe.sumelectzpe: -390.776521 hartree
zpe.sumelectthermal: -390.768429 hartree
zpe.sumelectthermalent: -390.767484 hartree
zpe.sumelectthermalfe: -390.809267 hartree
dipole: -17.2713 6.0251 -5.2473
dipole: 19.0298
quadrupole: -122.4358 -46.4301 -66.5127
quadrupole: 17.4910 -24.8332 4.8700
quadrupole: -43.9762 32.0294 11.9468 17.4910 -24.8332 4.8700
hfenergy: -390.8861949 hartree
pointgroup: C01 [X(C4H7B1F1N2)]
dipole: -2.7075457 4.7398555 -1.9218452 debye
dipolederiv: -0.0161553 -0.2756074 0.2336495 -0.0794338 -0.0670881 -0.050294 0.2582104 -0.2674682 -0.0771599 0.1079727 -0.0379101 -0.1042885 -0.0510482 -0.0135917 -0.0782379 -0.1054816 -0.0634112 0.1001188 0.1147682 -0.1316752 0.3107698 -0.0687683 0.1414631 -0.01977 0.3258967 -0.0813472 0.06074 -0.3170551 0.3825837 -0.1418457 0.2030809 -1.239003 0.0119418 -0.1977429 0.3193236 -0.2642654 -0.6600757 0.2114304 -0.2802061 0.192641 -0.8791029 0.1070726 -0.2916652 0.1256421 -0.5885293 0.4869567 0.0264299 -0.0250307 0.093932 0.4967142 0.0785689 -0.024241 0.0230682 0.5125914 -0.3582665 0.2333922 0.1160444 0.19499 -0.3402068 -0.1052661 0.1988975 -0.1866291 -0.3856032 0.2903813 -0.1498711 -0.0827806 -0.1779436 0.8036438 -0.0400999 -0.0780993 -0.0749925 0.2432723 -0.0596026 -0.1461013 0.0427546 -0.0122253 -0.1124392 0.0282461 0.0242956 0.0234158 0.0870082 0.0265034 0.0674827 -0.084217 0.0045158 0.0317056 -0.0276554 -0.0991244 0.0524832 -0.0276256 0.0015827 0.1120899 0.0767718 0.0623061 -0.0987678 0.008484 0.1284146 -0.1196913 -0.0645916 -0.3287959 -0.1811865 0.1519111 -0.0996067 -0.4316694 0.2182822 0.0780929 0.2582854 -0.3228635 -0.357841 -0.0709168 -0.2054237 -0.1754882 -0.3247378 -0.1859337 -0.219052 -0.0894902 -0.3631609 0.9777286 -0.101198 0.7037394 -0.1749739 1.3464033 -0.0070156 0.7111541 0.0401882 0.9287338 -0.9081016 0.0610577 -0.7118482 0.0880224 -0.3133232 0.0616769 -0.7095555 0.0406232 -0.8386653 unknown
polarizability: 91.08482|-9.2540036|118.3967874|14.5264357|-2.1960831|88.0160634 unknown
InChI: InChI=1/C4H7BFN2/c1-8-2-3(5)7-4(8)6/h2H,1,5H3
charge -1 multiplicity 1
15 atoms
C  2.94848026 1.74400916 0.88604157
H  3.4933874 2.4448259 1.49968198
C  3.02910756 0.38004234 0.78324678
N  1.96733472 2.19055018 -0.00512483
N  2.0797186 -0.02745552 -0.1832564
B  3.9981186 -0.63659555 1.57091242
H  4.6960756 -1.26976441 0.77305037
C  1.50184539 3.54265274 -0.20231007
H  2.35267245 4.20895865 -0.3595204
H  0.86215642 3.57949504 -1.08358451
H  0.93110326 3.89120228 0.66309528
H  3.33486541 -1.44206282 2.2314886
H  4.72912908 0.00703362 2.33281531
C  1.51734975 1.05947984 -0.57726695
F  0.5463666 1.13777592 -1.49772974
