program: Gaussian 16
title: h_indole_hydride
version: AS64L-G16RevC.02
method: RwB97XD
basis: GenECP
operation: Freq
keyword: #N
keyword: Geom=AllCheck
keyword: Guess=TCheck
keyword: SCRF=Check
keyword: GenChk
keyword: RwB97XD/GenECPFreq
converged: YES YES YES YES
title: Mulliken charges:
elementType: C C C C C C C C H H H N H B C H H H C H H H H H H
charge: -0.040023 -0.039000 -0.474178 -0.816526 0.658345 -0.605185 -0.372328 0.404108 0.147044 0.163650 0.186674 0.241616 0.179611 -0.091012 -0.442943 0.153196 0.116301 0.181771 -0.515539 0.161335 0.168513 0.160316 -0.199327 -0.118225 -0.208194
chargesum: -1.00000
title: Mulliken charges with hydrogens summed into heavy atoms:
elementType: C C C C C C C C N B C C
charge: -0.040023 0.140611 -0.474178 -0.669482 0.658345 -0.441535 -0.185654 0.404108 0.241616 -0.616758 0.008325 -0.025374
1716.lowfreq: -11.0131 -0.0007 -0.0005 -0.0004 7.9192 23.7627 52.0306 94.6609 103.4907
frequency: 51.7456 93.7578 103.0217 145.4996 190.8786 213.0915 254.4869 290.7706 306.3650 345.4933 353.6070 440.7557 456.0023 517.5748 565.1393 611.2271 618.2581 621.1911 716.9080 717.8048 773.9080 814.0515 818.7338 847.4691 870.1139 871.3746 908.5119 955.8657 965.7185 1020.0973 1060.5665 1093.0177 1119.7779 1152.2366 1155.7974 1165.8697 1170.0601 1188.3722 1194.8088 1229.7962 1262.2980 1324.4699 1347.9424 1380.1538 1412.1947 1425.0057 1455.2791 1483.3256 1490.5490 1497.0386 1509.1129 1525.3429 1533.2459 1541.2221 1632.6448 1677.9927 2286.0370 2306.1323 2360.4396 3017.9692 3028.0760 3071.7696 3085.7919 3113.9358 3153.6505 3170.6126 3171.2480 3177.3069 3239.5886
redmass: 1.0502 2.7541 1.3625 1.8403 2.9506 2.9473 1.1636 3.1499 2.4446 3.7968 2.8559 4.6096 2.7158 3.2283 4.1736 4.0065 2.7319 3.7831 1.9646 1.9444 3.1411 4.0083 1.5740 3.3185 1.4919 1.5950 1.7561 1.3346 2.4853 1.5447 1.4888 1.6989 2.1241 1.3111 1.3048 1.3875 1.2237 1.1399 1.2538 2.3960 2.2044 2.2924 3.5638 3.8395 1.3026 6.5455 1.2627 1.0451 1.2132 1.0456 1.1580 4.3192 3.5409 3.2744 6.7286 6.8211 1.0873 1.0671 1.0886 1.0392 1.0369 1.1036 1.1009 1.1009 1.0865 1.0942 1.0931 1.0945 1.0947
irintensity: 0.0558 7.3032 0.1144 0.4565 9.1247 2.7408 2.6219 0.2824 19.5800 0.4534 3.9722 12.4389 10.1717 9.8416 11.1203 15.3893 9.0373 4.1171 19.5417 18.3978 0.7099 2.9043 59.6097 2.5951 16.7461 23.8111 6.6207 1.1148 5.2024 24.1502 3.4080 25.1649 9.2603 0.7320 5.5331 126.4912 12.5943 41.1433 5.6830 9.3554 24.5956 49.0077 67.0413 3.9625 1.9629 57.8401 5.7546 7.8987 15.1994 10.6526 6.8159 186.6567 31.1428 51.2607 2.2287 6.3213 462.3267 466.5697 456.1672 108.7508 98.3034 48.9035 32.0500 31.7745 24.8660 17.6831 22.5390 41.5846 20.3469
temp: 298.150 k
press: 1.00000 atm
elementType: 6 6 6 6 6 6 6 6 1 1 1 7 1 5 6 1 1 1 6 1 1 1 1 1 1
symmnumber: 1
zpe: 536346.3 jmol-1
zpe.correction: 0.204284 hartree
zpe.thermalcorrener: 0.215721 hartree
zpe.thermalcorrenthalpy: 0.216665 hartree
zpe.thermalcorrgfe: 0.167233 hartree
zpe.sumelectzpe: -468.347384 hartree
zpe.sumelectthermal: -468.335947 hartree
zpe.sumelectthermalent: -468.335002 hartree
zpe.sumelectthermalfe: -468.384434 hartree
dipole: -12.3835 -3.3368 -0.4159
dipole: 12.8319
quadrupole: -136.9308 -76.6321 -84.2732
quadrupole: -5.5983 -1.1462 0.8855
quadrupole: -37.6521 22.6466 15.0055 -5.5983 -1.1462 0.8855
hfenergy: -468.5516673 hartree
pointgroup: C01 [X(C10H13B1N1)]
dipole: -4.9578851 -1.2604439 -0.1884486 debye
dipolederiv: 0.3112961 0.1623285 0.0258494 -0.3200598 0.7055194 0.0927753 -0.0313999 0.0991974 -0.1642508 -0.8609811 0.3269842 0.029186 0.2921775 -0.2328155 0.0185416 0.024627 0.0239442 -0.3442714 0.426675 -0.2134067 -0.0228142 -1.0660915 -0.0522677 -0.0199576 -0.1148329 -0.010109 0.0675131 0.1918238 0.051234 0.0106513 0.0255831 -0.0040131 0.0208548 0.0082211 0.0246717 -0.2103848 -0.0608028 0.0421267 -0.0029046 0.2777701 0.089998 0.0257919 -0.0019019 0.0178871 -0.1674194 -0.2629219 -0.0209794 -0.0040595 -0.3531977 -0.0563228 0.0150943 -0.0348146 0.0190844 -0.2287407 0.2132363 -0.080639 -0.0049735 0.0362114 0.1363546 0.0365252 0.0049457 0.0348837 -0.1765795 0.6250409 0.0685556 0.015182 0.877679 -0.2826587 -0.0185026 0.1076818 -0.0257344 -0.036563 0.0871239 -0.0048045 -0.0013853 -0.0258143 -0.1491258 -0.0339159 -0.0050995 -0.0349924 0.1543645 -0.1736357 0.1213552 0.0103429 0.1151362 0.0193458 -0.0138021 0.0071551 -0.0121718 0.1591246 0.0661878 -0.0022034 -0.0014513 0.0313667 -0.185137 -0.0363066 0.0017254 -0.0373938 0.1460952 -0.9084485 -0.1230094 -0.0263191 0.3000296 -0.9309544 -0.0712107 0.0388794 -0.1154235 -0.1516314 0.0093899 -0.0736414 -0.0101411 -0.0920528 -0.1158357 -0.0362187 -0.0130315 -0.0356554 0.1877058 0.4217183 0.0034315 -0.003501 0.107324 0.4921868 0.0104906 0.0149141 0.0072353 0.482222 0.1220701 -0.1147786 0.0043375 -0.2301794 0.7358053 0.0132822 -0.0139557 0.0269195 0.3317836 0.0474456 -0.1023381 -0.1094066 0.0478416 -0.0906904 -0.0497359 -0.0512615 -0.1375028 -0.110891 -0.021167 0.093958 0.0236114 0.0270963 0.0924036 0.0074671 0.0182326 0.002254 0.0901764 0.0698458 -0.077125 0.0609785 0.0660415 -0.1492192 0.0494738 0.0307179 0.165103 -0.1055354 0.0628048 -0.0571909 -0.0080236 0.0399604 0.1387321 -0.004483 0.0313971 0.0050919 0.1796068 0.0305082 0.0818224 0.0135799 -0.0685343 -0.1789672 -0.0377743 -0.0110712 -0.0418472 0.0712937 -0.1378019 -0.0552106 0.0768161 -0.0567629 0.0509917 -0.0414348 0.1751508 0.0005764 -0.0922574 -0.1350783 -0.0266572 -0.0857221 0.0161274 0.0276197 0.0792662 -0.1740034 0.0340452 -0.0510412 -0.402622 0.0565752 0.0914077 0.1017206 -0.2193503 -0.1716546 0.2437444 -0.1838178 -0.4919014 -0.3403608 -0.1197634 -0.0191444 -0.2974935 -0.5182349 -0.0574595 -0.0478528 -0.0578224 -0.1367546 -0.3813464 0.0633762 -0.0620962 0.1481208 -0.3233644 0.2228933 -0.2081675 0.2315766 -0.4016637 unknown
polarizability: 255.1613579|-3.2253238|180.9876511|0.6357769|6.8321144|113.9562273 unknown
InChI: InChI=1/C10H13BN/c1-7-3-4-8-6-10(11)12(2)9(8)5-7/h3-6H,1-2,11H3
charge -1 multiplicity 1
25 atoms
C  2.1794049 0.43002212 0.04424982
C  1.40229844 1.56523357 0.15911694
C  -0.00077146 -0.21562328 -0.05005486
C  -1.19111719 -0.93934077 -0.13141366
C  -2.39968697 -0.25431502 -0.06026537
C  -2.38901169 1.14573334 0.08709793
C  -1.20511644 1.86528372 0.16904574
C  0.0208385 1.19272517 0.10474572
H  -1.18028555 -2.0199727 -0.24485415
H  -3.33835318 1.67302063 0.13921603
H  -1.23338247 2.94513028 0.28421169
N  1.30059705 -0.6461486 -0.09005391
H  1.79696424 2.56438234 0.27630769
B  3.77952886 0.25130026 0.05725877
C  1.68249984 -2.0292686 -0.22450828
H  1.2198777 -2.47359844 -1.11255135
H  2.76457473 -2.08014582 -0.32622098
H  1.38102938 -2.61112234 0.65430151
C  -3.71339974 -0.99467189 -0.12918157
H  -3.55657465 -2.06340134 -0.2956173
H  -4.28386545 -0.88353011 0.79921766
H  -4.34217092 -0.61878057 -0.94285561
H  4.16765799 -0.2530415 -1.00218512
H  4.30773287 1.34879756 0.20860725
H  4.11745423 -0.50134199 0.97664541
