program: Gaussian 16
title: NH2_H-H-
version: ES64L-G16RevC.01
method: RwB97XD
basis: GenECP
operation: Freq
keyword: #N
keyword: Geom=AllCheck
keyword: Guess=TCheck
keyword: SCRF=Check
keyword: GenChk
keyword: RwB97XD/GenECP
keyword: Freq
converged: YES YES NO YES
title: Mulliken charges:
elementType: C H C N N B H C H H H H H C N H H
charge: -0.269835 0.168569 -0.112348 0.003184 -0.259876 -0.227070 -0.172982 -0.416103 0.161957 0.175586 0.184616 -0.173658 -0.183118 0.031724 -0.472019 0.295040 0.266332
chargesum: -1.00000
title: Mulliken charges with hydrogens summed into heavy atoms:
elementType: C C N N B C C N
charge: -0.101265 -0.112348 0.003184 -0.259876 -0.756827 0.106056 0.031724 0.089353
1716.lowfreq: -37.0571 -9.1936 -0.0006 -0.0001 0.0005 34.3837 117.6726 151.8370 196.3412
frequency: 115.5008 150.3759 195.5703 212.2987 240.9420 245.9805 304.1170 316.8739 486.5397 546.5209 634.4351 666.8410 676.1851 703.7081 812.5840 856.5980 875.1336 916.1601 988.3243 1069.3297 1132.4405 1149.0196 1161.1098 1163.6210 1184.0056 1196.5937 1237.5175 1292.5624 1384.1216 1455.6276 1495.5065 1511.4111 1550.8471 1569.7860 1582.4526 1656.2577 2258.7295 2289.5389 2306.5655 3025.3928 3099.6478 3139.1379 3256.0404 3547.3409 3641.9355
redmass: 1.6355 1.5123 1.1475 3.0818 1.1010 2.3027 2.6718 3.6655 2.7791 3.7168 2.0074 2.2827 3.1655 3.3754 2.7585 1.5204 1.6377 1.7879 6.5125 1.6882 1.3566 1.3260 1.0838 1.5142 1.3001 1.2456 2.7332 3.8141 5.7562 1.2901 1.0668 1.1207 5.9683 3.5878 4.2076 1.2894 1.0838 1.0924 1.0655 1.0417 1.0947 1.1037 1.0966 1.0520 1.0913
irintensity: 3.9432 5.4117 1.6235 0.9219 48.8575 8.2819 3.7109 11.7739 10.8901 7.2971 11.0545 30.1050 34.3405 26.9383 7.3607 197.7994 46.8303 14.0720 5.0473 10.4294 39.2947 39.2917 18.1765 60.4052 41.2369 27.0053 1.3800 30.2030 34.2960 21.4967 26.1832 2.0049 40.1401 187.0791 95.2038 96.0322 500.1028 551.6383 481.2628 114.3159 33.5027 12.9087 7.6668 3.0089 23.7179
temp: 298.150 k
press: 1.00000 atm
elementType: 6 1 6 7 7 5 1 6 1 1 1 1 1 6 7 1 1
symmnumber: 1
zpe: 354700.1 jmol-1
zpe.correction: 0.135098 hartree
zpe.thermalcorrener: 0.143618 hartree
zpe.thermalcorrenthalpy: 0.144562 hartree
zpe.thermalcorrgfe: 0.102602 hartree
zpe.sumelectzpe: -346.868746 hartree
zpe.sumelectthermal: -346.860226 hartree
zpe.sumelectthermalent: -346.859282 hartree
zpe.sumelectthermalfe: -346.901242 hartree
dipole: -19.6594 5.0412 -6.0148
dipole: 21.1680
quadrupole: -129.3127 -52.0332 -69.4388
quadrupole: 14.9535 -24.1444 7.0610
quadrupole: -45.7178 31.5617 14.1561 14.9535 -24.1444 7.0610
hfenergy: -347.0038441 hartree
pointgroup: C01 [X(C4H9B1N3)]
dipole: -3.7251085 4.3383165 -2.2180937 debye
dipolederiv: -0.0834697 -0.2973475 0.1899872 -0.0925839 -0.0791481 -0.0387911 0.1897794 -0.2311213 -0.1573268 0.096551 -0.0302927 -0.1153148 -0.0556614 -0.0207594 -0.0875925 -0.1142992 -0.083966 0.0961719 0.0794928 -0.0959684 0.255323 -0.0978705 0.1378061 -0.0412846 0.2856551 -0.0373869 0.0127319 -0.2632467 0.3659121 -0.0977201 0.1786419 -1.1922711 -0.0352471 -0.1873673 0.273196 -0.2607376 -0.737688 0.1743631 -0.3020268 0.226149 -0.8229193 0.1510387 -0.2427945 0.1049648 -0.5927755 0.5197327 0.0295072 -0.0199399 0.087191 0.5249091 0.0627068 -0.0208004 0.0124376 0.537856 -0.3602815 0.2309123 0.1120873 0.2033828 -0.348896 -0.1079105 0.2034765 -0.1992608 -0.3989348 0.2960543 -0.1682625 -0.089324 -0.1779898 0.7747182 -0.0071478 -0.0911779 -0.0670778 0.2359916 -0.066343 -0.1613342 0.0022831 -0.0258668 -0.0873261 0.0050025 -0.0119539 -0.0236954 0.0935006 0.0478292 0.0802364 -0.0593093 0.0286553 0.0340176 -0.0179053 -0.0709107 0.0812044 -0.0675823 -0.0712709 0.1543686 0.1001135 0.0649581 -0.1218747 0.0046366 0.1431631 -0.1019735 -0.0401843 -0.3292301 -0.1842738 0.1604738 -0.0864204 -0.4433874 0.2356597 0.0747361 0.2675272 -0.3459135 -0.3909781 -0.0806642 -0.216811 -0.1907472 -0.3276775 -0.184673 -0.2255803 -0.0865407 -0.356522 0.7330906 -0.0156272 0.5589051 -0.073077 1.0051202 0.0207088 0.5159867 0.044694 0.6392642 -0.6907153 -0.0483338 -0.4197666 0.1022674 -0.4085865 0.2433572 -0.5688565 0.1042142 -0.9128361 0.1864562 0.017472 -0.0225529 -0.019588 0.1178656 -0.0690233 -0.0039936 0.025161 0.3213695 0.0340165 0.0293326 -0.0364076 -0.0714404 0.2584096 -0.1335351 0.1249374 -0.0823769 0.1959271 unknown
polarizability: 107.640109|-8.9646658|128.1079941|19.9189658|-1.6013309|101.2510863 unknown
InChI: InChI=1/C4H9BN3/c1-8-2-3(5)7-4(8)6/h2H,6H2,1,5H3
charge -1 multiplicity 1
17 atoms
C  2.94027338 1.74717452 0.89637291
H  3.48783095 2.44828589 1.50799103
C  3.02518893 0.38398438 0.78755813
N  1.9391067 2.18675583 0.02874211
N  2.0499846 -0.02081811 -0.14092499
B  4.0198254 -0.62941262 1.54910568
H  4.6923458 -1.27054638 0.73373062
C  1.52318637 3.5454339 -0.2104684
H  2.3885327 4.20784186 -0.14523755
H  1.10102143 3.62073367 -1.21433382
H  0.77304041 3.87878493 0.51545649
H  3.37965281 -1.43349044 2.23788411
H  4.78319804 0.01267117 2.28271136
C  1.44564333 1.06502742 -0.54882343
N  0.4405703 1.13403709 -1.53228588
H  0.30909505 0.20599167 -1.91365386
H  -0.4452253 1.4523531 -1.15574434
