program: Gaussian 16
title: NO2_H-H-
version: ES64L-G16RevC.01
method: RwB97XD
basis: GenECP
operation: Freq
keyword: #N
keyword: Geom=AllCheck
keyword: Guess=TCheck
keyword: SCRF=Check
keyword: GenChk
keyword: RwB97XD/GenECPFreq
converged: YES YES NO YES
title: Mulliken charges:
elementType: C H C N N B H C H H H H H C N O O
charge: -0.070972 0.225491 -0.048818 0.028835 -0.110362 -0.269214 -0.145762 -0.409530 0.144847 0.212394 0.211014 -0.144951 -0.157497 -0.043616 -0.284975 -0.099585 -0.037300
chargesum: -1.00000
title: Mulliken charges with hydrogens summed into heavy atoms:
elementType: C C N N B C C N O O
charge: 0.154519 -0.048818 0.028835 -0.110362 -0.717423 0.158726 -0.043616 -0.284975 -0.099585 -0.037300
1716.lowfreq: -34.5034 -27.7753 -0.0005 0.0007 0.0008 13.7060 58.5081 85.8151 97.6219
frequency: 53.0639 83.3956 97.2223 137.3092 178.2261 184.0961 273.9359 297.8059 382.9911 433.9472 567.9732 585.4404 620.0315 655.6888 746.2412 756.1072 783.3588 859.8886 887.7687 910.2880 990.9838 1053.5531 1148.5364 1149.7508 1158.4536 1176.6237 1185.5595 1205.9750 1250.6012 1396.7983 1406.3518 1427.1874 1462.3277 1478.3109 1507.8884 1525.0807 1557.9571 1602.1342 2303.8367 2314.4954 2347.2525 3077.0846 3162.2437 3169.5026 3259.1809
redmass: 6.8203 1.0509 1.1936 2.8182 3.2541 3.5694 3.6794 4.1829 4.2654 7.7278 4.3010 4.4242 3.9985 4.0821 7.6518 6.0045 1.4269 1.6017 6.9509 1.8347 5.6368 1.9269 1.3083 1.2296 1.1397 1.0774 1.6399 2.6683 6.2623 9.4973 3.8730 9.6438 1.3140 1.0401 1.1881 7.3524 5.0582 10.2310 1.0736 1.0847 1.0860 1.0321 1.1060 1.1060 1.0980
irintensity: 7.4338 0.1935 0.2000 7.6055 11.6439 6.0581 3.3809 0.4394 0.6625 10.7581 4.8764 3.4984 10.6651 7.7387 0.1809 25.5172 40.0229 3.3118 51.3150 4.7237 28.7940 275.9244 2.4984 75.9341 28.8659 13.0523 123.8304 96.3769 390.5893 77.7281 40.1589 856.3245 34.1995 12.0204 11.4267 172.3750 218.2672 243.4925 435.2395 439.1427 432.9637 38.8949 12.2094 9.4930 1.9433
temp: 298.150 k
press: 1.00000 atm
elementType: 6 1 6 7 7 5 1 6 1 1 1 1 1 6 7 8 8
symmnumber: 1
zpe: 315888.6 jmol-1
zpe.correction: 0.120316 hartree
zpe.thermalcorrener: 0.130126 hartree
zpe.thermalcorrenthalpy: 0.131070 hartree
zpe.thermalcorrgfe: 0.084464 hartree
zpe.sumelectzpe: -496.026417 hartree
zpe.sumelectthermal: -496.016607 hartree
zpe.sumelectthermalent: -496.015663 hartree
zpe.sumelectthermalfe: -496.062268 hartree
dipole: -13.1800 5.9106 -1.7337
dipole: 14.5483
quadrupole: -124.3125 -58.4046 -81.5856
quadrupole: 21.8117 -24.9225 8.1124
quadrupole: -36.2116 29.6963 6.5153 21.8117 -24.9225 8.1124
hfenergy: -496.1467324 hartree
pointgroup: C01 [X(C4H7B1N3O2)]
dipole: -1.9962399 4.6244869 -1.2823679 debye
dipolederiv: -0.4486006 -0.2721458 -0.2875979 0.6274891 0.232871 0.5797285 -0.2026885 -0.1955659 -0.3350392 0.1080413 -0.0388346 -0.0606337 -0.0536298 0.0102068 -0.0621509 -0.0622727 -0.0489818 0.1163116 -0.1429188 -0.3122132 -0.0307246 -0.9650967 0.0618636 -0.8129204 -0.08988 -0.2469936 -0.2406604 0.295242 0.4363077 0.3822466 0.4328741 -0.9572962 0.2951089 0.3837544 0.2880697 0.2552131 0.1048719 0.2831096 0.389845 -0.1991763 -0.6699446 -0.199574 0.3466892 0.2115781 -0.0024805 0.4980319 0.0512621 0.0244877 0.1400867 0.4120952 0.1049161 0.0191277 0.0366603 0.4870896 -0.3616239 0.2047924 0.0561576 0.2174666 -0.3092357 -0.0805466 0.1854165 -0.1869846 -0.3612366 0.2612696 -0.0763144 -0.0062622 -0.0673773 0.6434204 -0.0254729 -0.0062976 -0.0293811 0.25437 0.0160103 -0.0995722 -0.0839831 -0.0065661 -0.012085 -0.0164378 -0.0754426 -0.0970346 0.0263578 0.0700635 0.0308856 0.0268853 0.0093657 -0.0286078 -0.0173229 0.0273888 0.0915692 -0.066541 -0.0682171 0.0914003 0.0516395 -0.0178189 -0.0265338 0.0083929 0.0399288 0.0141875 0.0646427 -0.3063184 -0.1555522 0.1524408 -0.0387062 -0.3581359 0.2501145 0.0354232 0.2457309 -0.3716174 -0.3923261 -0.0861634 -0.2102674 -0.1935605 -0.3364935 -0.1688786 -0.2095333 -0.0819652 -0.3168682 -1.0370477 -0.0681436 -1.0594337 0.0447291 0.6998204 0.0835795 -1.0489863 -0.0094233 -0.7243872 2.1620421 0.0015614 1.6602803 0.0113719 2.0707097 0.1997579 1.6702153 0.1957746 1.7070405 -0.9422448 0.3659603 -0.5091375 0.7212832 -1.2537661 0.5292547 -0.4809625 0.2253929 -0.7064665 -0.816275 -0.35634 -0.4959428 -0.6627344 -1.1788885 -0.667549 -0.5318802 -0.4126331 -0.7857284 unknown
polarizability: 135.4227908|-7.6925703|135.5173726|49.256905|-1.2104576|120.1762112 unknown
InChI: InChI=1/C4H7BN3O2/c1-7-2-3(5)6-4(7)8(9)10/h2H,1,5H3
charge -1 multiplicity 1
17 atoms
C  2.93222325 1.75124535 0.8082951
H  3.52353912 2.45033889 1.38027663
C  3.00112633 0.36304196 0.73858832
N  1.93371261 2.19451529 -0.00830131
N  2.02359456 -0.03841427 -0.13914819
B  4.0196029 -0.6113653 1.51762269
H  4.66387972 -1.27955801 0.70960027
C  1.57487655 3.59122616 -0.19822826
H  2.23538646 4.18517566 0.43253844
H  1.70297834 3.88283913 -1.23964786
H  0.53878011 3.76519128 0.08785898
H  3.39402052 -1.37060176 2.25803832
H  4.79363639 0.07634125 2.19012766
C  1.42141612 1.05240376 -0.55504975
N  0.34708564 1.05716121 -1.48847559
O  -0.14132932 2.14628489 -1.80077523
O  -0.04129557 -0.00624725 -1.93735435
