program: Gaussian 16
title: h_naphthalene_hydride
version: AS64L-G16RevC.02
method: RwB97XD
basis: GenECP
operation: Freq
keyword: #N
keyword: Geom=AllCheck
keyword: Guess=TCheck
keyword: SCRF=Check
keyword: GenChk
keyword: RwB97XD/GenECPFreq
converged: YES YES YES YES
title: Mulliken charges:
elementType: C C C C C C H C C H H C C H H H B N C H H H C H H H H H H
charge: -0.277188 -0.081692 0.025643 0.480309 -0.233263 -0.576628 0.151346 0.297208 -0.399671 0.154948 0.196097 -0.531111 -0.399911 0.153123 0.187803 0.184038 -0.334836 0.274443 -0.326957 0.108887 0.172069 0.173530 -0.439845 0.175770 0.118905 0.151214 -0.131299 -0.138248 -0.134685
chargesum: -1.00000
title: Mulliken charges with hydrogens summed into heavy atoms:
elementType: C C C C C C C C C C B N C C
charge: -0.125842 -0.081692 0.025643 0.480309 -0.078315 -0.380531 0.297208 -0.246548 -0.343308 -0.215873 -0.739069 0.274443 0.127529 0.006045
1716.lowfreq: -0.0003 -0.0002 -0.0002 9.0337 23.5604 32.7932 66.9172 117.9405 145.7856
frequency: 65.7846 116.8591 145.5536 163.9459 211.0460 237.4080 279.3703 297.7851 317.2257 335.3555 350.1224 352.6236 406.7341 465.5860 481.1710 497.2176 514.4540 533.6061 555.7457 611.3819 622.8093 690.7607 752.3227 775.2460 790.2441 798.9431 831.3813 872.8231 884.0963 897.5355 937.7078 942.9320 981.1999 997.7912 999.9083 1057.6633 1095.4307 1112.8534 1122.3714 1133.3374 1159.0861 1171.2228 1178.1735 1186.8611 1189.5407 1196.3893 1220.2889 1235.1760 1248.4357 1276.4946 1335.5356 1379.8639 1386.4014 1405.2316 1451.6860 1459.7258 1473.3265 1483.9085 1491.4629 1499.4049 1503.7580 1530.4066 1553.7020 1622.0049 1655.8256 1672.9071 2271.4285 2338.1002 2346.4916 2908.1665 2916.4699 3066.3271 3094.2146 3126.3026 3152.2903 3162.6638 3168.7717 3170.2124 3182.8913 3185.0077 3208.2968
redmass: 3.1039 3.0434 3.5774 3.0170 3.0778 2.5388 1.3302 1.3790 1.2011 2.1713 3.1332 1.8213 2.8516 4.1103 3.1318 3.8273 3.8436 4.1974 5.8958 3.0038 4.1739 3.1095 1.2924 4.5947 1.7030 3.1241 2.2827 1.7183 1.5560 1.9045 2.8627 1.5384 1.3127 1.3252 3.6537 3.5650 1.4286 1.9582 1.5635 1.4453 1.2405 1.3211 1.3865 1.2253 1.1554 1.0815 2.2030 1.6114 1.9243 4.0111 2.6615 2.3453 6.0976 3.2358 1.1808 1.8656 1.4669 1.0947 1.3568 1.1064 1.2373 1.1637 3.9649 5.7930 5.8446 6.0804 1.0817 1.0651 1.0914 1.0614 1.0623 1.0712 1.0746 1.1014 1.0844 1.0860 1.0982 1.0907 1.0952 1.0952 1.0925
irintensity: 9.0983 7.3876 4.2933 11.4900 5.6347 3.4832 1.3055 2.6208 0.0906 4.4527 2.0970 2.1823 4.8246 15.3043 5.8937 2.7660 2.3263 0.2216 1.1019 7.6499 8.3618 8.8216 9.3238 2.3039 68.7731 29.1665 43.7808 19.2688 1.5913 5.8848 2.3319 2.2826 0.9350 1.3978 48.4096 57.2288 14.8866 9.3848 21.5999 3.0432 40.8241 64.0513 15.6662 55.2544 15.5384 16.6614 6.1833 13.3963 5.2844 27.5018 13.1059 17.7620 20.8544 75.5376 1.0128 23.5149 10.4427 25.2694 4.0689 22.2738 25.2698 26.1263 12.7546 181.9193 16.6898 15.3220 559.9304 336.4180 425.0043 113.4240 295.3300 65.7813 49.2752 28.8364 6.1217 1.6507 11.1597 36.0438 73.0405 75.6108 26.5258
temp: 298.150 k
press: 1.00000 atm
elementType: 6 6 6 6 6 6 1 6 6 1 1 6 6 1 1 1 5 7 6 1 1 1 6 1 1 1 1 1 1
symmnumber: 1
zpe: 631034.9 jmol-1
zpe.correction: 0.240348 hartree
zpe.thermalcorrener: 0.252569 hartree
zpe.thermalcorrenthalpy: 0.253513 hartree
zpe.thermalcorrgfe: 0.203077 hartree
zpe.sumelectzpe: -545.685538 hartree
zpe.sumelectthermal: -545.673317 hartree
zpe.sumelectthermalent: -545.672373 hartree
zpe.sumelectthermalfe: -545.722810 hartree
dipole: 0.9482 9.1367 2.4564
dipole: 9.5085
quadrupole: -91.2837 -122.5010 -98.2542
quadrupole: 2.4661 0.0203 -8.2407
quadrupole: 12.7292 -18.4880 5.7588 2.4661 0.0203 -8.2407
hfenergy: -545.9258862 hartree
pointgroup: C01 [X(C12H15B1N1)]
dipole: 0.3487231 3.6617374 1.0252079 debye
polarizability: 259.7548914|6.1355042|250.4956586|-9.0761344|-6.3322996|136.9418732 unknown
InChI: InChI=1/C12H15BN/c1-14(2)11-8-4-6-9-5-3-7-10(13)12(9)11/h3-8H,1-2,13H3
charge -1 multiplicity 1
29 atoms
C  1.12237413 1.86221773 -0.33032303
C  0.91800359 0.5133689 -0.11241736
C  -0.42531825 -0.017156 -0.02909969
C  -1.48169829 0.94567596 0.05474915
C  -1.22131776 2.33185775 -0.12913599
C  0.04737516 2.77286409 -0.36764236
H  2.13253449 2.24444933 -0.41704641
C  -0.73402981 -1.43081427 -0.0846258
C  -2.81256679 0.51743569 0.28171534
H  -2.05596561 3.02613302 -0.09745728
H  0.24456012 3.82722384 -0.53530142
C  -3.08663748 -0.81942885 0.36881943
C  -2.06256365 -1.76012055 0.15171476
H  -3.59765188 1.26292868 0.37118903
H  -4.10243296 -1.16037998 0.55105317
H  -2.33346387 -2.81125274 0.11591815
B  0.2507045 -2.65179822 -0.56229641
N  2.01295651 -0.3477539 0.07075209
C  3.2748168 0.02423321 -0.51519261
H  3.80506454 0.82397603 0.03760521
H  3.9256383 -0.85527457 -0.52820903
H  3.12831978 0.35393247 -1.54561542
C  2.15907051 -0.86286168 1.4178776
H  2.80354498 -1.74537083 1.40774282
H  2.60028575 -0.10248993 2.09061518
H  1.19189726 -1.16614265 1.81384683
H  -0.46937418 -3.62543049 -0.81393422
H  1.06465702 -2.9978558 0.29027808
H  0.85943008 -2.33077926 -1.58320181
