program: Gaussian 16
title: H_H-H-
version: ES64L-G16RevC.01
method: RwB97XD
basis: GenECP
operation: Freq
keyword: #N
keyword: Geom=AllCheck
keyword: Guess=TCheck
keyword: SCRF=Check
keyword: GenChk
keyword: RwB97XD/GenECP
keyword: Freq
converged: YES YES NO YES
title: Mulliken charges:
elementType: C H C N N B H C H H H H H C H
charge: -0.347744 0.153277 -0.072349 0.030236 -0.234585 -0.224788 -0.168176 -0.380893 0.178814 0.135627 0.180257 -0.168102 -0.183504 -0.075316 0.177246
chargesum: -1.00000
title: Mulliken charges with hydrogens summed into heavy atoms:
elementType: C C N N B C C
charge: -0.194467 -0.072349 0.030236 -0.234585 -0.744569 0.113804 0.101929
1716.lowfreq: -54.6515 0.0001 0.0004 0.0005 22.6354 39.5600 73.6801 153.3892 176.5349
frequency: 73.4809 152.9538 175.7421 240.6266 271.8935 384.1232 553.8065 623.3621 671.2539 715.6462 717.6170 802.8972 857.5297 913.8014 976.0159 1056.1772 1081.7931 1133.9459 1148.0692 1160.1602 1180.4568 1192.1615 1234.0832 1270.5478 1399.5717 1422.2200 1457.0196 1482.1959 1520.5816 1543.8251 1567.9314 2256.3232 2301.3986 2313.0059 3037.4562 3101.6338 3136.6237 3218.2440 3254.0576
redmass: 1.1722 2.3084 1.0721 2.5741 3.1288 2.6514 3.7142 3.1309 2.7826 1.4383 3.2880 1.3987 1.4290 1.7629 5.2801 3.6955 1.5672 1.3120 1.3045 1.0867 1.3112 1.1863 1.7917 2.7723 4.9349 4.3743 1.3275 1.0390 1.1520 6.0517 3.3802 1.0832 1.0953 1.0639 1.0339 1.1053 1.1021 1.0951 1.0971
irintensity: 0.2021 0.8787 0.1034 4.1565 1.5978 1.1763 10.5868 11.8217 5.8577 33.0434 5.6211 36.3412 27.6017 7.5999 15.8526 16.8326 8.3823 60.7262 0.6629 10.2326 77.5857 36.7065 11.6690 38.4186 8.3968 9.1556 31.0026 9.6316 16.6568 89.4215 59.0625 486.8600 546.1122 467.6842 105.6448 33.5351 21.7203 17.9800 6.0048
temp: 298.150 k
press: 1.00000 atm
elementType: 6 1 6 7 7 5 1 6 1 1 1 1 1 6 1
symmnumber: 1
zpe: 308637.9 jmol-1
zpe.correction: 0.117554 hartree
zpe.thermalcorrener: 0.124816 hartree
zpe.thermalcorrenthalpy: 0.125760 hartree
zpe.thermalcorrgfe: 0.086262 hartree
zpe.sumelectzpe: -291.523380 hartree
zpe.sumelectthermal: -291.516118 hartree
zpe.sumelectthermalent: -291.515174 hartree
zpe.sumelectthermalfe: -291.554672 hartree
dipole: -18.2781 6.1721 -6.6897
dipole: 20.4191
quadrupole: -120.3310 -43.5639 -61.1726
quadrupole: 16.6927 -25.2149 3.8725
quadrupole: -45.3085 31.4586 13.8499 16.6927 -25.2149 3.8725
hfenergy: -291.6409344 hartree
pointgroup: C01 [X(C4H8B1N2)]
dipole: -2.6536568 4.8711024 -1.9607288 debye
dipolederiv: -0.0961418 -0.268272 0.109308 0.0097795 -0.0282077 0.0263198 0.1313921 -0.2283915 -0.1422327 0.0955452 -0.0519994 -0.1074415 -0.0652539 -0.0162719 -0.0771858 -0.1067118 -0.0632739 0.1087869 0.0388946 -0.1633606 0.2059533 -0.1882455 0.09001 -0.1428232 0.204061 -0.1157907 -0.0335043 -0.1807898 0.3393239 0.0123426 0.2351258 -1.1876339 0.123747 -0.0039476 0.2332816 -0.1445744 -0.4803611 0.2501082 -0.0704523 0.0436993 -0.8158414 0.0071258 -0.0811244 0.1865735 -0.4479461 0.5065657 0.0329711 -0.0182715 0.0969236 0.5036826 0.0724105 -0.0203639 0.0173969 0.525483 -0.3551109 0.2343837 0.1115577 0.2038486 -0.3513548 -0.1079377 0.1997315 -0.1969936 -0.3928736 0.2849828 -0.1344801 -0.0580207 -0.129865 0.8154489 -0.0694409 -0.0556496 -0.0828786 0.2781602 -0.060419 -0.1442249 0.0810724 -0.0080534 -0.1350883 0.0487197 0.0492885 0.0766322 0.0484534 -0.0356416 0.0662401 -0.1145608 -0.0288788 0.0222521 -0.0343632 -0.1233131 0.052771 -0.0138608 0.0445383 0.0793948 0.0482041 0.0578988 -0.1101221 -0.0112455 0.091014 -0.1479106 -0.0875913 -0.3313974 -0.1835787 0.1626302 -0.0935661 -0.427481 0.2298145 0.0816691 0.2612365 -0.3422264 -0.3819478 -0.08016 -0.2130853 -0.1881772 -0.3284748 -0.182102 -0.2210862 -0.0858779 -0.3568922 -0.0479349 -0.0240061 -0.001811 -0.0049402 0.9118805 0.0724825 0.0013947 0.0592225 -0.0404905 -0.0007821 0.0476601 -0.1474253 0.0597044 0.0572017 0.0444784 -0.1463545 0.0340025 0.0413086 unknown
polarizability: 94.6386655|-7.667596|120.4500402|15.8028779|-3.0731372|90.207451 unknown
InChI: InChI=1/C4H8BN2/c1-7-2-4(5)6-3-7/h2-3H,1,5H3
charge -1 multiplicity 1
15 atoms
C  2.95124384 1.76206465 0.88830763
H  3.53689567 2.45722159 1.47113392
C  2.99346635 0.38853526 0.8123699
N  1.95912859 2.20903209 0.0334757
N  2.00972001 -0.00215952 -0.1036035
B  3.96767301 -0.63132137 1.59384844
H  4.64288154 -1.28463807 0.79112877
C  1.56254395 3.57572838 -0.20073154
H  2.40148415 4.16451625 -0.58177064
H  0.76177786 3.59370581 -0.94187407
H  1.19539814 4.03930878 0.71912206
H  3.31096418 -1.4219007 2.28059153
H  4.72939841 0.00739341 2.33193518
C  1.43185161 1.09448114 -0.53051862
H  0.6249844 1.15473152 -1.25055474
