program: Gaussian 16
title: h_quinoline_hydride
version: AS64L-G16RevC.02
method: RwB97XD
basis: GenECP
operation: Freq
keyword: #N
keyword: Geom=AllCheck
keyword: Guess=TCheck
keyword: SCRF=Check
keyword: GenChk
keyword: RwB97XD/GenECP
keyword: Freq
converged: YES YES NO YES
title: Mulliken charges:
elementType: C C C C C C H C H H C C H H H N B H H H
charge: -0.303115 0.215128 -1.466584 0.689530 -0.245164 -0.438738 0.190306 0.744897 0.150521 0.193025 -0.788426 0.081431 0.212116 0.197739 0.219873 0.116882 -0.310271 -0.152264 -0.155200 -0.151688
chargesum: -1.00000
title: Mulliken charges with hydrogens summed into heavy atoms:
elementType: C C C C C C C C C N B
charge: -0.112809 0.215128 -1.466584 0.689530 -0.094642 -0.245712 0.957013 -0.590687 0.301304 0.116882 -0.769422
1716.lowfreq: -0.0003 0.0004 0.0007 16.2379 24.7517 38.1773 119.6266 179.6601 234.7034
frequency: 119.1961 179.4915 234.6563 264.3558 352.3556 427.2268 439.3726 479.3544 484.3686 529.1672 544.6135 571.3565 656.6487 686.6862 758.1783 798.7453 807.0720 827.7775 849.4180 885.3749 893.0284 950.3123 965.7184 995.7432 1000.1238 1020.6013 1053.1914 1092.9208 1135.5355 1153.0068 1170.7809 1188.0499 1218.0665 1223.2079 1254.5313 1271.1849 1338.8643 1397.4256 1413.4874 1455.4007 1493.4145 1543.2338 1617.8890 1656.1203 1679.0140 2297.3828 2322.6501 2326.6523 3131.5432 3155.5056 3167.9676 3170.2666 3184.3155 3201.7755
redmass: 3.4540 4.1035 3.0615 2.8337 1.0654 3.5818 3.5882 5.0832 3.2220 5.8578 2.8570 6.2739 3.3846 5.9268 1.1788 2.3204 2.4031 1.6037 3.2978 2.7903 1.7284 1.5409 1.4199 1.3375 1.3345 3.8448 2.7082 2.0869 1.3037 1.2960 1.3123 1.0702 1.0947 2.1125 2.1118 1.7545 2.8133 5.0784 2.0349 2.0744 2.8818 3.8284 7.1422 5.6942 6.6688 1.0751 1.0925 1.0727 1.0890 1.0845 1.0888 1.0901 1.0974 1.0970
irintensity: 4.1269 5.1616 0.9658 8.8686 1.0320 0.3040 7.8286 4.2850 0.6418 0.4348 7.8639 1.2249 2.7937 13.3222 6.6961 26.2053 30.5953 86.5202 7.1529 0.9209 4.2095 1.1759 0.0999 0.1025 2.1240 33.2063 1.9752 10.7613 91.5246 2.9287 27.6348 13.7919 8.9740 1.5826 1.4932 2.8316 12.5526 70.1284 8.2591 1.7794 32.4634 50.7346 6.4611 3.1598 27.9315 520.3010 444.3380 384.0250 58.8843 3.3117 23.5259 37.3887 73.2598 41.6624
temp: 298.150 k
press: 1.00000 atm
elementType: 6 6 6 6 6 6 1 6 1 1 6 6 1 1 1 7 5 1 1 1
symmnumber: 1
zpe: 406935.6 jmol-1
zpe.correction: 0.154994 hartree
zpe.thermalcorrener: 0.163235 hartree
zpe.thermalcorrenthalpy: 0.164179 hartree
zpe.thermalcorrgfe: 0.122192 hartree
zpe.sumelectzpe: -427.858264 hartree
zpe.sumelectthermal: -427.850022 hartree
zpe.sumelectthermalent: -427.849078 hartree
zpe.sumelectthermalfe: -427.891065 hartree
dipole: 7.5620 -10.6837 -0.0886
dipole: 13.0894
quadrupole: -80.9968 -96.5148 -75.9551
quadrupole: 16.8284 0.2993 -0.0540
quadrupole: 3.4921 -12.0259 8.5338 16.8284 0.2993 -0.0540
hfenergy: -428.0132574 hartree
pointgroup: C01 [X(C9H9B1N1)]
dipole: 3.0137403 -4.2681897 -0.0041775 debye
dipolederiv: 0.1563198 -0.2561964 0.0050661 0.0966449 -0.5114555 -0.0017005 0.0085698 -0.0165935 -0.1944186 -0.3048226 -0.0521169 -0.010034 -0.2130594 0.4432766 0.0082889 -0.0104001 0.0101059 -0.1728836 0.4539513 0.3290937 0.0211738 -0.2808884 -0.08992 -0.0074584 0.002572 0.0070188 0.0966124 -0.2469864 0.0656548 -0.0096475 0.5561432 -0.1077794 0.0136876 0.0039506 0.0044354 0.0410043 -0.2168636 0.1202661 0.0054242 -0.0247922 -0.0525281 0.0042404 0.0022875 0.0000991 -0.2412214 0.0890234 -0.0850704 0.0054498 -0.0898964 0.3394824 0.0108775 0.0065697 0.0141418 -0.1406397 -0.1852762 0.0223699 -0.0087776 0.051219 0.0787552 0.00047 -0.0064365 0.0000336 0.1260644 0.398682 0.0647348 0.0185131 0.0400427 0.2503619 0.0127692 0.0214675 0.0111302 -0.1431564 0.0342634 0.1009211 -0.0014669 0.0277312 -0.1660884 -0.0084488 -0.0036241 -0.0037347 0.1620832 -0.0630534 -0.1515733 -0.0111513 -0.1449936 -0.0817973 -0.0109046 -0.0116276 -0.0125172 0.1487342 -0.1208353 -0.1123397 -0.0026436 -0.325567 -0.3408994 -0.0145338 -0.0113791 -0.0062948 -0.1791639 0.1760564 -0.042513 0.0067957 0.173426 0.5633087 0.023986 0.0134998 0.0179765 -0.036532 0.0560844 0.0375961 -0.0011456 0.1002929 -0.135881 -0.0052102 0.0011852 -0.0073581 0.1372372 -0.1698172 0.0386582 -0.0090904 0.0456368 0.0777944 -0.0009647 -0.0090301 -0.0017255 0.1645023 -0.105533 -0.1166469 -0.0104384 -0.1716965 -0.068454 -0.0111494 -0.0125368 -0.0098253 0.1138934 -0.479253 0.0123282 -0.0110118 0.1021673 -0.4985548 -0.0023238 -0.0025292 -0.0042171 -0.2867645 0.6374391 -0.0583356 0.0136265 -0.0005159 0.2552026 -0.0001475 0.0245095 -0.0125764 0.4648916 -0.18498 -0.0091753 -0.1364604 0.0397588 -0.3643996 -0.163711 -0.0619405 -0.2749458 -0.4768204 -0.7076816 0.1416708 -0.0315161 -0.0007148 -0.2178529 -0.0032582 -0.0467012 0.0121064 -0.1545749 -0.2167176 -0.0493261 0.1673343 0.0190616 -0.3725716 0.155491 0.0915938 0.2727407 -0.4288477 unknown
polarizability: 216.3914796|4.7892426|184.6689276|3.9082959|2.680544|94.9562591 unknown
InChI: InChI=1/C9H9BN/c10-8-5-1-3-7-4-2-6-11-9(7)8/h1-6H,10H3
charge -1 multiplicity 1
20 atoms
C  -2.25434305 -0.27052553 -0.0599688
C  -1.34974329 0.77646142 -0.00264719
C  0.03764251 0.39081551 0.031897
C  0.42521058 -0.98390365 0.00469027
C  -0.56408241 -1.99621671 -0.05491352
C  -1.88293557 -1.63388136 -0.08502104
H  -3.3129855 -0.02769078 -0.08782934
C  1.80490049 -1.29524032 0.03639393
H  -0.25968573 -3.03877626 -0.07557282
H  -2.65479319 -2.39733153 -0.1313059
C  2.72602247 -0.28716625 0.09406549
C  2.25037021 1.04295489 0.11919161
H  2.1138982 -2.33696612 0.01488578
H  3.79143751 -0.48671716 0.11999867
H  2.96358362 1.8650387 0.16633807
N  0.98495705 1.3740368 0.08995934
B  -1.84633637 2.32071878 0.00978125
H  -1.4857157 2.8882217 1.04296178
H  -3.07968679 2.34478293 -0.06793138
H  -1.36482005 2.93223694 -0.94541919
