program: Gaussian 16
title: h_xanthene_hydride
version: AS64L-G16RevC.02
method: RwB97XD
basis: GenECP
operation: Freq
keyword: #N
keyword: Geom=AllCheck
keyword: Guess=TCheck
keyword: SCRF=Check
keyword: GenChk
keyword: RwB97XD/GenECP
keyword: Freq
converged: YES YES YES YES
title: Mulliken charges:
elementType: C C C C C C H H H C O C H H H C H H H C C C C C H C H H B N C H H H C H H H H H H
charge: 0.386092 -0.276564 -0.774327 -0.288081 0.476635 -0.100056 0.195248 0.194975 0.132688 -0.156866 -0.012074 -0.431909 0.150074 0.161473 0.190728 -0.776758 0.174247 0.165275 0.195344 0.621844 -0.081325 -0.378589 -0.220376 -0.562011 0.135664 -0.089552 0.225223 0.162705 -0.296590 0.193251 -0.433079 0.140270 0.165983 0.160745 -0.365704 0.171014 0.138533 0.159800 -0.177297 -0.119858 -0.156795
chargesum: -1.00000
title: Mulliken charges with hydrogens summed into heavy atoms:
elementType: C C C C C C C O C C C C C C C C B N C C
charge: 0.386092 -0.081316 -0.579352 -0.155394 0.476635 -0.100056 -0.156866 -0.012074 0.070367 -0.241893 0.621844 -0.081325 -0.242925 -0.220376 -0.336788 0.073153 -0.750540 0.193251 0.033919 0.103643
1716.lowfreq: -11.6653 -0.0007 -0.0006 -0.0004 16.9306 25.5596 54.6985 68.7282 115.8185
frequency: 53.3043 68.0706 113.6692 133.9794 158.1762 164.3364 188.0777 224.0369 233.6892 251.8592 263.4147 269.3267 300.6076 302.7606 310.3883 315.6703 345.5247 369.3220 377.8392 388.0442 409.6667 435.7403 456.2360 492.6301 516.3730 521.9667 545.5637 564.9505 573.5448 584.7294 596.6475 607.0893 653.2642 690.3638 725.3167 757.7331 772.7702 785.4410 818.9602 820.6356 849.5352 878.4209 894.4428 896.3352 904.7062 922.8923 944.7673 949.6193 975.4571 977.8963 995.7980 1029.4992 1034.5885 1086.2974 1105.4442 1119.8569 1130.3544 1144.7620 1160.7497 1168.5265 1182.4716 1186.4170 1188.8842 1196.1562 1201.6282 1223.1686 1241.4872 1255.7825 1284.7566 1287.8012 1291.6028 1315.5185 1332.5743 1338.5615 1350.5285 1386.1186 1395.5143 1418.4905 1447.4793 1456.4765 1474.4044 1481.6332 1487.3045 1494.8252 1497.6511 1497.7419 1508.7510 1512.4823 1513.6417 1520.4173 1534.1555 1543.0714 1630.5446 1650.0817 1652.6611 1674.0805 2305.7111 2310.1204 2355.4138 2939.7264 2953.5410 3029.1464 3048.2383 3081.2566 3102.1993 3105.9677 3122.5094 3127.5831 3129.4342 3129.5535 3156.5236 3176.0895 3182.4284 3188.8223 3206.1575 3216.7121 3222.1064
redmass: 4.1637 3.5092 3.6588 3.1469 2.9017 3.0787 3.3844 1.7724 2.0577 1.3069 2.0122 2.4122 1.6215 1.5869 2.4595 2.3727 2.5877 2.3162 4.0420 1.8991 2.2363 3.5952 2.7694 4.1398 2.6580 2.1079 4.7532 3.6042 3.4055 3.7923 3.5533 4.1871 4.4470 5.8448 3.6082 1.4436 1.9324 1.8715 4.4921 4.2913 4.6844 2.4550 1.4706 3.7442 1.5317 1.8290 1.6312 1.4901 1.3269 2.0148 1.3392 1.8076 1.5800 1.4256 2.3382 2.0323 1.3490 1.9141 1.5913 2.0915 1.4686 1.5029 1.5099 1.3936 1.3072 1.9994 2.4291 2.4721 3.0075 2.0049 4.5307 2.3320 1.1422 5.6030 5.9307 2.9606 1.2539 1.2516 1.1642 3.0498 1.2232 1.0775 1.1161 1.0494 1.6382 1.3061 1.2690 1.2384 1.7037 1.1445 1.1525 2.1823 5.6929 7.4421 6.2341 7.8879 1.0812 1.0796 1.0786 1.0593 1.0594 1.0355 1.0363 1.0725 1.0808 1.1027 1.1014 1.1022 1.1024 1.1032 1.0856 1.0933 1.0878 1.0978 1.0923 1.0904 1.0941
irintensity: 0.8368 5.1583 4.9551 2.8356 6.4809 4.8935 0.8001 4.2269 2.5707 1.0856 1.8571 6.6691 2.0784 4.7404 3.4745 6.3759 3.4641 1.0582 3.0174 0.2780 0.7948 2.3912 0.5167 3.9604 1.2628 2.4223 3.7570 1.5978 6.2065 1.8218 10.4289 1.2072 1.4798 2.8149 0.3120 59.7204 50.0342 27.2837 6.4406 17.7835 7.6208 11.8634 2.6929 33.3958 4.2363 2.2152 0.3110 2.9803 0.4611 5.1834 0.9818 60.1866 34.9705 23.2389 30.1161 17.4426 5.8882 39.4451 52.8713 10.1599 56.0318 6.5425 2.9897 15.9219 55.0742 134.3039 15.9635 38.2943 23.1989 12.2135 343.9450 34.8706 33.3857 16.2173 35.7715 82.6213 18.7713 5.6989 7.2757 254.9559 1.2884 12.5781 28.4436 15.0032 9.2091 24.0285 42.9590 41.5682 10.6982 10.2335 10.3584 175.4298 22.2517 1.7512 26.1180 62.9846 543.9800 402.4330 361.7976 142.1147 208.7632 48.0016 36.1167 41.2443 40.5641 35.5151 51.1534 15.1817 47.6979 28.8290 10.3346 61.9535 15.4167 4.5757 37.2622 19.5045 22.6952
temp: 298.150 k
press: 1.00000 atm
elementType: 6 6 6 6 6 6 1 1 1 6 8 6 1 1 1 6 1 1 1 6 6 6 6 6 1 6 1 1 5 7 6 1 1 1 6 1 1 1 1 1 1
symmnumber: 1
zpe: 903633.8 jmol-1
zpe.correction: 0.344176 hartree
zpe.thermalcorrener: 0.361642 hartree
zpe.thermalcorrenthalpy: 0.362586 hartree
zpe.thermalcorrgfe: 0.301242 hartree
zpe.sumelectzpe: -814.955951 hartree
zpe.sumelectthermal: -814.938485 hartree
zpe.sumelectthermalent: -814.937541 hartree
zpe.sumelectthermalfe: -814.998885 hartree
dipole: 1.5806 -13.4452 -0.4498
dipole: 13.5453
quadrupole: -126.0306 -179.7203 -132.9786
quadrupole: 5.6719 -0.8616 -2.4676
quadrupole: 20.2126 -33.4771 13.2646 5.6719 -0.8616 -2.4676
hfenergy: -815.3001273 hartree
pointgroup: C01 [X(C17H21B1N1O1)]
dipole: 0.6254046 -5.3218203 -0.2809132 debye
polarizability: 326.4861392|0.9118068|315.2437707|7.3019377|14.8983724|191.2783834 unknown
InChI: InChI=1/C17H21BNO/c1-17(2)11-7-5-9-13(18)15(11)20-16-12(17)8-6-10-14(16)19(3)4/h5-10H,1-4,18H3
charge -1 multiplicity 1
41 atoms
C  -1.23058954 2.45231901 -0.03651526
C  -2.53331322 2.78277215 -0.43017785
C  -3.5128949 1.82526713 -0.68365222
C  -3.22948127 0.4755522 -0.52001434
C  -1.95556802 0.07950305 -0.11015731
C  -1.00200765 1.07625929 0.08483307
H  -2.77583014 3.83511822 -0.55068797
H  -4.50527042 2.13093852 -1.00255906
H  -4.00340785 -0.26123963 -0.70080462
C  -1.5759809 -1.3586579 0.23468527
O  0.28222559 0.70348687 0.44797115
C  -2.5073304 -2.37811135 -0.42560957
H  -2.23899534 -3.39592919 -0.13234668
H  -3.53795469 -2.22090035 -0.1004912
H  -2.4728014 -2.30794212 -1.51609125
C  -1.67208165 -1.52933534 1.76975273
H  -2.70004694 -1.35741446 2.10286761
H  -1.37001447 -2.5413741 2.05863807
H  -1.02382339 -0.81598095 2.28351318
C  -0.11955667 -1.5666174 -0.17007452
C  0.74947236 -0.49574683 0.0150746
C  0.38981311 -2.76931918 -0.66410997
C  2.13451459 -0.59087455 -0.25281026
C  1.74167945 -2.89121336 -0.93619725
H  -0.26688388 -3.61299855 -0.83463404
C  2.60515587 -1.82177695 -0.72089186
H  2.13730867 -3.82820926 -1.31343694
H  3.65867436 -1.94858448 -0.93341775
B  -0.08742049 3.56702967 0.26108054
N  2.96763559 0.5288339 -0.11983754
C  2.9680988 1.227047 1.16100452
H  3.44749434 0.62105408 1.94892548
H  3.53059252 2.15599205 1.05061006
H  1.95728536 1.48983759 1.45808981
C  4.29332713 0.42486894 -0.68736038
H  4.74332542 1.41970763 -0.69479014
H  4.96367868 -0.24496458 -0.11908206
H  4.24133197 0.0707812 -1.71910963
H  0.31687759 3.46550838 1.4237331
H  -0.56653949 4.69186376 0.09539286
H  0.88020731 3.41222088 -0.48593539
