program: Gaussian 16
title: Me_iPr-H- restart3
version: ES64L-G16RevC.01
method: RwB97XD
basis: GenECP
operation: Freq
keyword: #N
keyword: Geom=AllCheck
keyword: Guess=TCheck
keyword: SCRF=Check
keyword: GenChk
keyword: RwB97XD/GenECPFreq
converged: YES YES NO YES
title: Mulliken charges:
elementType: H C C C C H C H C H B H C C C H H H H H H C C C H H H H H H H H N C H H H C H H H
charge: 0.192537 -0.460203 -0.485980 -0.501965 0.737406 0.144542 0.358309 0.182570 -0.823476 0.184330 -0.649031 0.087541 -0.010236 -0.658210 -0.613459 0.122370 0.147609 0.125504 0.127736 0.121096 0.154950 0.087827 -0.590114 -0.620455 0.146226 0.124749 0.140893 0.118946 0.162082 0.128337 0.126871 0.083158 0.222253 -0.269248 0.139776 0.145558 0.148864 -0.229996 0.152861 0.148531 0.148944
chargesum: -1.00000
title: Mulliken charges with hydrogens summed into heavy atoms:
elementType: C C C C C C B C C C C C C N C C
charge: -0.267667 -0.341439 -0.319395 0.737406 0.542639 -0.823476 -0.561490 0.116634 -0.262727 -0.209677 0.170985 -0.178246 -0.211090 0.222253 0.164950 0.220340
1716.lowfreq: -39.3624 -17.7310 -0.0004 -0.0003 0.0004 14.6252 52.3385 61.8375 70.4972
frequency: 41.8105 61.1421 67.4036 93.3324 110.0803 132.6243 143.4521 152.7142 198.9915 214.8037 231.0875 232.3189 242.7282 264.5794 277.5200 285.9586 290.1744 308.3977 319.2924 342.5495 368.8659 404.5116 406.5142 430.7374 444.3814 506.2102 539.8418 551.9463 600.3095 632.3615 718.8710 754.2526 766.2109 808.3095 813.0727 835.3055 899.7599 916.0728 923.2868 925.9876 933.0891 974.5307 978.0724 981.1218 990.1436 1007.6315 1013.7338 1016.0559 1070.1245 1077.8489 1086.7366 1103.3268 1114.5469 1125.2010 1139.0358 1158.9114 1168.5915 1173.1423 1180.6711 1182.9092 1184.7804 1191.9669 1262.9702 1269.0263 1274.9985 1286.1903 1297.7783 1346.1007 1355.0899 1359.7916 1382.4909 1392.3536 1398.6764 1404.4690 1436.4515 1456.3828 1472.2077 1472.8270 1480.5817 1481.8241 1485.3624 1488.4645 1495.0131 1496.8025 1499.3591 1502.7729 1506.5460 1510.6067 1517.8683 1531.8647 1618.6174 1649.5265 2330.3376 2957.5476 2967.0658 2977.8388 2978.6940 2984.0922 2989.5179 2991.4140 3000.1051 3040.2179 3041.5526 3044.5230 3047.0872 3050.4682 3052.9351 3081.6355 3082.7813 3086.8355 3097.8286 3101.5794 3112.8859 3154.3859 3173.2255 3189.2775 3196.4549
redmass: 2.5151 2.9918 3.0495 2.4712 2.9955 2.6794 2.9838 3.3009 1.7958 1.3886 1.9193 1.9907 1.1275 1.6820 1.2817 1.6311 1.4890 1.3716 1.9187 2.6186 3.2776 2.3900 2.1531 2.8032 2.5962 3.6260 3.9776 3.2371 3.1093 4.5653 3.3931 2.0818 2.5193 2.5704 2.9609 2.4176 1.5596 1.7124 1.4633 1.2387 1.7211 1.3762 1.3911 1.3686 3.1468 1.2949 1.4724 1.3641 2.6879 1.9304 1.4484 1.9611 1.2987 1.6230 1.6483 1.8294 1.3130 1.9461 1.6341 1.4090 2.0134 1.7897 1.5552 4.2524 1.7705 1.8631 2.9317 1.2968 1.2490 2.9362 1.2624 1.2678 1.2342 1.2321 1.1584 1.5952 1.2791 1.1391 1.0493 1.0509 1.0792 1.0487 1.0520 1.1607 1.2176 1.4121 1.0717 1.0784 1.0476 1.1110 5.8390 5.9106 1.0783 1.0776 1.0766 1.0463 1.0446 1.0454 1.0493 1.0355 1.0365 1.0939 1.0941 1.0952 1.0996 1.0885 1.0993 1.1004 1.0990 1.0956 1.0954 1.0994 1.0979 1.0844 1.0901 1.0910 1.0959
irintensity: 0.1102 0.0233 0.3032 0.1529 1.3207 0.3518 0.5847 0.3525 10.7561 0.0434 0.2034 0.3785 0.1862 5.3721 0.9457 0.6012 0.4084 0.2409 0.1522 0.5629 1.3730 1.7424 0.6642 0.6192 1.0234 8.6349 6.5795 5.6795 9.8019 4.4806 3.9385 50.6309 26.4961 4.1144 3.7052 0.8361 3.3945 2.1307 2.2387 3.2212 5.8291 4.9820 0.2178 0.2606 13.5818 6.6560 21.4787 7.9955 32.0629 8.7716 6.0525 12.3122 7.2316 29.2544 9.9157 17.1534 8.4271 43.3696 20.8292 0.1210 0.6867 3.6627 3.3534 29.7878 15.4539 20.9082 11.2949 2.3807 0.8237 28.4829 4.8039 6.2379 5.8106 5.8187 0.0422 13.4134 12.5704 6.9872 1.0133 2.6213 4.7811 4.8643 6.9456 23.3550 5.7462 7.1558 10.2849 5.5323 1.3379 23.0693 1.6566 8.6683 369.5910 58.7864 124.1709 106.6149 71.1965 182.3592 169.4551 122.7929 152.2367 63.9725 101.2976 187.3835 7.4578 110.8085 5.0732 65.5694 71.9310 67.6681 53.5772 50.0930 42.5526 6.1549 36.7376 63.3750 33.8075
temp: 298.150 k
press: 1.00000 atm
elementType: 1 6 6 6 6 1 6 1 6 1 5 1 6 6 6 1 1 1 1 1 1 6 6 6 1 1 1 1 1 1 1 1 7 6 1 1 1 6 1 1 1
symmnumber: 1
zpe: 956852.5 jmol-1
zpe.correction: 0.364446 hartree
zpe.thermalcorrener: 0.382691 hartree
zpe.thermalcorrenthalpy: 0.383636 hartree
zpe.thermalcorrgfe: 0.319797 hartree
zpe.sumelectzpe: -627.833978 hartree
zpe.sumelectthermal: -627.815732 hartree
zpe.sumelectthermalent: -627.814788 hartree
zpe.sumelectthermalfe: -627.878627 hartree
dipole: -21.5148 -9.9957 1.1279
dipole: 23.7502
quadrupole: -211.7656 -148.2525 -122.6112
quadrupole: -48.6777 4.3658 2.8285
quadrupole: -50.8892 12.6239 38.2653 -48.6777 4.3658 2.8285
hfenergy: -628.1984237 hartree
pointgroup: C01 [X(C14H25B1N1)]
dipole: -0.3163375 -0.8616545 0.1167122 debye
polarizability: 240.5361082|6.5601083|248.9940908|1.4744596|-6.4541361|201.627011 unknown
InChI: InChI=1/C14H25BN/c1-11(2)15(12(3)4)13-9-7-8-10-14(13)16(5)6/h7-12,15H,1-6H3
charge -1 multiplicity 1
41 atoms
H  0.38586888 0.95023811 0.01755965
C  1.43207493 0.65608434 0.02591043
C  2.42713875 1.6186107 -0.08353817
C  1.78550242 -0.68252361 0.15284773
C  3.80921754 1.33661802 -0.08942018
H  2.11839795 2.65583744 -0.16594721
C  3.13445046 -1.00508592 0.18649682
H  1.02960305 -1.4572221 0.23871544
C  4.13239089 -0.02772871 0.08154852
H  3.45208154 -2.03580303 0.31007115
B  4.83891099 2.60747396 -0.30099396
H  6.01322892 2.25191504 -0.16420775
C  4.72769191 3.23195209 -1.84085495
C  5.01494406 2.19635394 -2.93296767
C  3.42343204 3.96390018 -2.18712815
H  6.01444833 1.76632189 -2.81937442
H  4.29866578 1.36637452 -2.88127147
H  4.94894645 2.62555928 -3.94473899
H  3.15996386 4.71072096 -1.4293383
H  3.49048438 4.48295266 -3.15500351
H  2.58360377 3.26326356 -2.26160725
C  4.55431773 3.7566536 0.85590105
C  4.74141785 3.20576535 2.27370371
C  5.4358128 4.99737939 0.67899634
H  5.77562815 2.86786473 2.41960751
H  4.52906737 3.95702175 3.0495733
H  4.09139674 2.34314928 2.45436215
H  5.29086446 5.73331382 1.48457308
H  6.49640322 4.71356649 0.67891749
H  5.23780926 5.50603477 -0.27008955
H  5.53009886 3.98374852 -1.90736047
H  3.50788649 4.0992805 0.78571521
N  5.47286781 -0.55656142 0.20627745
C  6.17604278 -0.16624481 1.41391703
H  7.03562017 -0.83322675 1.55831744
H  6.53692302 0.87130764 1.3915978
H  5.51171992 -0.28035095 2.27476391
C  6.30706201 -0.50303533 -0.97816758
H  6.74393175 0.48820644 -1.1581723
H  7.12321494 -1.23029175 -0.87447005
H  5.7152629 -0.77955844 -1.85409129
