program: Gaussian 16
title: MeQHBiPr-H-
version: ES64L-G16RevC.01
method: RwB97XD
basis: GenECP
operation: Freq
keyword: #N
keyword: Geom=AllCheck
keyword: Guess=TCheck
keyword: SCRF=Check
keyword: GenChk
keyword: RwB97XD/GenECPFreq
converged: YES YES YES YES
title: Mulliken charges:
elementType: C H C N N N B C H H H H C C C H H H H H H C C C H H H H H H H H
charge: -1.036812 0.209786 -0.370629 0.379019 -0.080734 -0.040391 0.435146 -0.386089 0.178808 0.185786 0.180253 -0.204354 0.161098 -0.652728 -0.583843 0.136593 0.105344 0.150270 0.114214 0.152864 0.125509 0.208245 -0.756180 -0.613019 0.146386 0.160828 0.095883 0.114210 0.127162 0.156180 0.072986 0.128209
chargesum: -1.00000
title: Mulliken charges with hydrogens summed into heavy atoms:
elementType: C C N N N B C C C C C C C
charge: -0.827026 -0.370629 0.379019 -0.080734 -0.040391 0.230792 0.158759 0.234084 -0.260521 -0.191256 0.336454 -0.353084 -0.215468
1716.lowfreq: -40.0575 -9.8136 -0.0005 -0.0004 0.0001 11.6853 57.8511 69.0268 73.3019
frequency: 48.6559 65.2630 71.7738 90.9174 103.6523 124.6180 153.4959 189.8422 204.7642 224.5341 243.1709 263.1002 277.6089 299.1471 315.3433 323.6650 370.1920 404.9545 409.3255 455.8802 484.0914 650.5285 681.1594 734.9482 751.4851 784.8751 803.8995 822.5150 909.1955 923.6571 932.3412 936.4197 974.6356 979.0197 991.6795 1011.8088 1030.1232 1058.5676 1071.1162 1079.6165 1096.3551 1130.6200 1142.0717 1151.5928 1165.9738 1184.5699 1193.5730 1263.9974 1268.8562 1282.7094 1304.1726 1344.7420 1364.6780 1367.3380 1384.2792 1391.7695 1398.4678 1408.2749 1446.5672 1467.1775 1476.4974 1484.5652 1486.9303 1489.0078 1491.6825 1495.2392 1499.1059 1505.5095 1509.6520 1519.6447 1553.9689 2308.5670 2934.1196 2973.2635 2976.4440 2981.4848 2984.7586 2990.5952 3040.4505 3042.0481 3048.7811 3054.2274 3057.4392 3077.5000 3088.0262 3090.6621 3096.2814 3124.1943 3169.7562 3272.0437
redmass: 2.8737 3.9582 3.4741 1.1100 2.1325 2.6619 2.9068 2.9292 1.4046 1.2742 1.1804 1.3626 1.7601 2.0317 2.6681 3.6673 2.5488 2.2237 2.4865 2.5138 2.9750 3.6966 4.3567 4.3573 2.7672 2.5918 1.7114 2.1524 1.9556 1.2195 1.5954 1.3661 1.3492 1.3878 1.2948 1.8377 3.4068 1.9993 2.9086 1.4483 2.1951 1.9539 2.1623 1.3142 1.9945 1.9146 1.8920 3.0352 2.3916 1.8269 3.9265 1.2908 1.2713 4.6959 1.2794 1.2859 1.2358 1.2272 1.3728 2.8307 1.0421 1.0432 1.0502 1.0398 1.0529 1.0484 1.0459 1.0480 1.0471 1.2496 5.2995 1.0775 1.0797 1.0715 1.0472 1.0449 1.0453 1.0537 1.0964 1.0933 1.0889 1.0348 1.0873 1.0976 1.0977 1.0953 1.0970 1.1058 1.1018 1.0984
irintensity: 5.3460 7.4242 0.6670 0.1364 2.3413 1.0565 0.6829 0.5413 2.0361 0.4105 0.1925 0.7767 1.3768 0.1532 0.6418 0.2763 1.1274 0.6176 4.5604 1.1060 4.2577 3.0072 0.3380 2.2940 6.5599 5.7404 26.4801 8.1448 0.5631 0.8398 3.5545 3.5825 0.9941 0.5569 47.2593 48.3421 1.1247 45.2982 24.6370 26.4974 18.9792 4.7802 4.7312 0.1767 41.2814 1.2241 2.9114 23.9317 18.8335 28.1733 20.7932 1.5948 2.4289 23.8086 4.5782 10.5922 5.7210 3.7427 10.3173 21.7989 3.6082 2.2846 2.5545 12.1795 3.2100 4.7664 6.2391 3.3901 6.3238 15.4365 9.6838 439.4652 92.6713 150.5634 99.5050 59.2379 218.5795 148.6193 40.7376 94.0460 99.8789 87.3150 75.3697 83.8447 83.3764 60.2574 56.3405 23.9512 5.7905 1.8889
temp: 298.150 k
press: 1.00000 atm
elementType: 6 1 6 7 7 7 5 6 1 1 1 1 6 6 6 1 1 1 1 1 1 6 6 6 1 1 1 1 1 1 1 1
symmnumber: 1
zpe: 728716.1 jmol-1
zpe.correction: 0.277553 hartree
zpe.thermalcorrener: 0.292804 hartree
zpe.thermalcorrenthalpy: 0.293749 hartree
zpe.thermalcorrgfe: 0.235566 hartree
zpe.sumelectzpe: -543.270575 hartree
zpe.sumelectthermal: -543.255324 hartree
zpe.sumelectthermalent: -543.254379 hartree
zpe.sumelectthermalfe: -543.312562 hartree
dipole: -16.9346 5.6121 -3.9624
dipole: 18.2750
quadrupole: -161.7952 -82.1401 -111.3223
quadrupole: 15.6603 -19.2866 6.9761
quadrupole: -43.3760 36.2791 7.0969 15.6603 -19.2866 6.9761
hfenergy: -543.5481279 hartree
pointgroup: C01 [X(C9H19B1N3)]
dipole: -0.0714694 3.0920074 0.6022631 debye
polarizability: 170.2191559|-13.0459536|181.4725963|10.0364416|-6.4253081|176.8840942 unknown
InChI: InChI=1/C9H19BN3/c1-7(2)10(8(3)4)9-6-13(5)12-11-9/h6-8,10H,1-5H3
charge -1 multiplicity 1
32 atoms
C  2.77680023 1.79013824 0.94042972
H  3.1707653 2.433948 1.71076419
C  2.93087475 0.4368212 0.70500792
N  1.96066464 2.26103389 -0.03123092
N  1.60449518 1.26850423 -0.85105664
N  2.17715308 0.18013157 -0.41791361
B  3.84058378 -0.64017434 1.51150316
C  1.47704976 3.6052948 -0.24048391
H  2.31158024 4.29244604 -0.39627688
H  0.84659207 3.59617473 -1.12824513
H  0.88868187 3.93915356 0.61707803
H  3.39172736 -1.77468471 1.28710139
C  3.73657857 -0.35612251 3.13593605
C  2.30327323 -0.5144464 3.65582826
C  4.66656222 -1.2621898 3.94844965
H  1.95903008 -1.54507028 3.50280935
H  2.21416688 -0.29246671 4.73054388
H  1.60785147 0.1386791 3.11862738
H  4.56215433 -1.11194746 5.03379393
H  4.44138825 -2.31614153 3.73885945
H  5.71887743 -1.1002133 3.6929243
C  5.39790981 -0.59554803 0.94800486
C  5.47011763 -0.86707383 -0.5569514
C  6.13925903 0.70622425 1.27303332
H  4.95511279 -1.80084757 -0.80541489
H  4.96492936 -0.07356788 -1.12126013
H  6.50456997 -0.93229893 -0.92802118
H  6.19732739 0.87824964 2.3539437
H  7.16748636 0.7139715 0.88101263
H  5.61963662 1.56810545 0.83366441
H  4.04120069 0.68587406 3.34338435
H  5.94586715 -1.41169394 1.44556201
