program: Gaussian 16
title: H_Me-H-
version: ES64L-G16RevC.01
method: RwB97XD
basis: GenECP
operation: Freq
keyword: #N
keyword: Geom=AllCheck
keyword: Guess=TCheck
keyword: SCRF=Check
keyword: GenChk
keyword: RwB97XD/GenECPFreq
converged: YES YES NO YES
title: Mulliken charges:
elementType: C C C C C C H H H H N B H C H H H C H H H H H
charge: -0.383367 0.417700 1.148317 -1.353687 -0.405014 -0.385024 0.174669 0.139560 0.158060 0.166118 -0.300192 -0.179507 -0.183909 -0.570049 0.114657 0.091687 0.109177 -0.579172 0.097597 0.112712 0.105343 0.263010 0.241315
chargesum: -1.00000
title: Mulliken charges with hydrogens summed into heavy atoms:
elementType: C C C C C C N B C C
charge: -0.208698 0.557260 1.148317 -1.353687 -0.246954 -0.218906 0.204133 -0.363416 -0.254529 -0.263519
1716.lowfreq: -40.6447 -8.9632 0.0006 0.0008 0.0009 29.1697 74.5817 113.7366 186.1446
frequency: 61.9301 113.6119 186.0908 214.5520 234.6320 252.7173 291.6537 316.7254 370.1372 386.3003 455.1722 467.4469 500.0283 564.8343 581.6057 679.8091 720.3603 737.1276 745.9233 764.8498 787.7403 802.0841 850.2383 864.7342 904.9171 937.2893 960.9766 978.6249 1009.6224 1061.9088 1078.0574 1098.9320 1134.6356 1167.3744 1175.4749 1199.1141 1276.5034 1286.4058 1295.8184 1308.0822 1358.3548 1469.9848 1476.2146 1477.7326 1482.2014 1498.1516 1516.5298 1626.6291 1645.1934 1657.1263 2146.2035 2966.4302 2970.8701 3021.8976 3024.8799 3038.1143 3057.5612 3140.1940 3147.9798 3165.5976 3184.9338 3534.7293 3654.0900
redmass: 2.9546 3.2155 3.1410 2.9523 1.2430 1.6478 1.1951 3.1024 2.6012 1.0592 3.0407 2.8907 2.8206 3.6706 4.3799 3.9925 1.5898 1.2679 1.2160 2.2907 1.9529 1.6071 2.4440 1.7880 1.5807 1.5444 1.7253 1.3359 2.0772 2.4873 1.9626 1.5278 1.6349 1.2894 1.0947 1.9999 1.9318 1.5329 1.2653 2.3096 2.3473 1.0555 1.4868 1.0955 1.4013 1.0591 2.4967 2.7655 2.4019 2.2442 1.0771 1.0375 1.0381 1.0977 1.0972 1.0992 1.0953 1.0863 1.0869 1.0910 1.0981 1.0516 1.0938
irintensity: 1.1733 0.1086 2.3986 4.8282 2.4575 1.9411 1.6240 3.4211 3.7109 73.3178 6.6072 4.9144 10.5829 19.6517 0.2481 1.8970 208.2007 48.4579 14.5364 0.5493 116.8810 10.3445 4.0138 10.2752 1.9023 14.9949 5.7085 0.9398 18.9461 34.5433 3.9493 64.7230 51.9710 12.8836 1.5527 94.2298 49.5676 36.8343 28.4186 61.6459 0.4929 2.3045 37.2323 3.8802 10.1115 0.8648 38.4192 4.4689 17.9356 141.5409 556.3073 82.5591 127.9423 25.7611 193.8979 139.9514 92.9012 41.2036 3.9644 63.7342 67.1447 57.9205 30.6232
temp: 298.150 k
press: 1.00000 atm
elementType: 6 6 6 6 6 6 1 1 1 1 7 5 1 6 1 1 1 6 1 1 1 1 1
symmnumber: 1
zpe: 508925.2 jmol-1
zpe.correction: 0.193839 hartree
zpe.thermalcorrener: 0.204146 hartree
zpe.thermalcorrenthalpy: 0.205090 hartree
zpe.thermalcorrgfe: 0.158964 hartree
zpe.sumelectzpe: -392.166103 hartree
zpe.sumelectthermal: -392.155797 hartree
zpe.sumelectthermalent: -392.154853 hartree
zpe.sumelectthermalfe: -392.200978 hartree
dipole: -11.6627 -10.7934 -1.2522
dipole: 15.9400
quadrupole: -109.1939 -92.4259 -78.7438
quadrupole: -29.8050 -4.4049 -0.2820
quadrupole: -15.7393 1.0286 14.7107 -29.8050 -4.4049 -0.2820
hfenergy: -392.3599423 hartree
pointgroup: C01 [X(C8H13B1N1)]
dipole: -2.1597871 0.1668456 -0.0827841 debye
dipolederiv: -0.2114808 -0.0852208 0.0261642 0.042442 -0.0885997 -0.0170454 -0.0085546 -0.0351212 -0.218266 0.0706147 0.1059423 0.0316497 -0.016969 0.2215683 -0.1049889 0.0520193 -0.0942619 -0.146412 0.0646984 0.2104245 -0.043103 -0.1631706 -0.6139486 0.0762018 0.0346811 0.113556 -0.2647161 -0.0333585 0.3724593 -0.0859294 0.5492564 1.3969031 -0.2679201 -0.1333434 -0.2472726 0.055524 -0.0248735 -0.3536349 0.1199206 0.1020295 -0.1507376 -0.0063063 0.0362448 -0.0963696 -0.2026506 -0.0394449 0.0419553 0.0290032 -0.1780617 0.0994215 -0.0902505 0.0672397 -0.0746583 -0.1814161 0.0160508 -0.0955133 -0.0057373 -0.1149216 -0.180751 0.0583272 -0.0030205 0.0626206 0.1545724 0.0255035 0.1403522 -0.044289 0.119874 -0.0747767 0.0703328 -0.0377403 0.0782187 0.0905992 -0.0562585 0.1170778 -0.0637761 0.1382599 -0.0943387 0.0763896 -0.0727027 0.0824948 0.124082 -0.1988688 -0.0666083 -0.0492064 -0.060707 0.0652309 0.0106044 -0.0511104 0.0071248 0.1483606 -0.4475139 -0.3721866 0.0477005 -0.3861349 -1.3349531 0.272008 0.1371678 0.6110942 -0.5790835 0.6297969 -0.051975 0.0446782 -0.0473003 0.6592047 0.0282402 0.0968707 0.0630528 0.6436434 -0.312372 -0.0145315 -0.0251839 -0.0180537 -0.6181137 -0.2001671 -0.0675954 -0.2117205 -0.3335971 -0.1572632 -0.0138312 0.1707149 0.0007749 0.0249596 0.058208 0.125871 0.0827206 -0.3683176 0.0461688 0.0937383 -0.1224657 0.0515855 -0.0976584 0.1730183 -0.0939452 0.1319129 -0.1070428 -0.3983584 -0.1132533 0.0292389 -0.1220545 0.0234126 0.0002768 0.0146749 -0.0088016 0.0707908 0.0445252 -0.0074422 0.0016062 0.0634816 -0.2114718 -0.2132566 0.0249322 -0.1312946 -0.0557204 -0.1589818 0.1483594 -0.1483229 0.1752354 -0.1668087 0.2359372 -0.153695 0.1726904 -0.1390267 0.0663255 -0.0016482 0.0081335 0.051297 -0.2677677 -0.099334 0.0349856 -0.1674297 -0.0136963 -0.3452044 -0.046827 -0.1019973 -0.1033524 0.0560111 -0.0421883 -0.07842 -0.021011 0.0434461 0.0173267 -0.0468282 0.1560603 -0.0258798 0.0282665 0.0613866 0.1085961 0.0781243 -0.2592589 0.3291818 -0.0410438 0.0000293 -0.0706267 0.1845427 -0.035004 -0.0492492 -0.1562768 0.2422852 0.0737863 0.080235 0.0251115 0.012996 0.1404048 -0.0444699 0.0160933 -0.2393921 0.2959003 unknown
polarizability: 177.2102561|7.4769594|164.4899664|6.7711814|-12.6873844|115.3262975 unknown
InChI: InChI=1/C8H13BN/c1-9(2)7-5-3-4-6-8(7)10/h3-6,9H,10H2,1-2H3
charge -1 multiplicity 1
23 atoms
C  -0.44513505 0.64037074 0.39660971
C  0.90341348 0.96212149 0.57246149
C  1.42673306 2.24467975 0.38526464
C  0.49083597 3.23367315 -0.00702775
C  -0.86363383 2.93181872 -0.1792434
C  -1.33462135 1.63760886 0.0204496
H  -0.7934133 -0.37568713 0.55851617
H  1.58296151 0.17303878 0.88588013
H  -1.55194558 3.71822285 -0.48261731
H  -2.38894624 1.41751728 -0.1198303
N  0.93733213 4.542165 -0.26346635
B  3.01396205 2.59404413 0.59391978
H  3.08509535 3.69634804 1.18954581
C  3.75909165 2.74327533 -0.86873255
H  3.2765731 3.47364115 -1.53278245
H  4.8113299 3.04783674 -0.76324281
H  3.75962063 1.78111784 -1.40538328
C  3.78706556 1.47736512 1.51433814
H  3.84197691 0.4935931 1.02079315
H  4.82541591 1.7795755 1.71328739
H  3.31002733 1.31552015 2.49197155
H  1.82798175 4.71745886 0.18869527
H  0.25886957 5.25636392 -0.04123055
